id_mutation,date_mutation,numero_disposition,nature_mutation,valeur_fonciere,adresse_numero,adresse_suffixe,adresse_nom_voie,adresse_code_voie,code_postal,code_commune,nom_commune,code_departement,ancien_code_commune,ancien_nom_commune,id_parcelle,ancien_id_parcelle,numero_volume,lot1_numero,lot1_surface_carrez,lot2_numero,lot2_surface_carrez,lot3_numero,lot3_surface_carrez,lot4_numero,lot4_surface_carrez,lot5_numero,lot5_surface_carrez,nombre_lots,code_type_local,type_local,surface_reelle_bati,nombre_pieces_principales,code_nature_culture,nature_culture,code_nature_culture_speciale,nature_culture_speciale,surface_terrain,longitude,latitude
2019-530330,2019-01-14,000001,Vente,38000,,,LE BOURG,B019,35380,35305,Saint-Péran,35,,,35305000ZD0155,,,,,,,,,,,,,0,,,,,AB,terrains a bâtir,,,934,-2.055469,48.054929
2019-531287,2019-03-29,000001,Vente,30000,,,LE GACEL,B197,35380,35305,Saint-Péran,35,,,35305000ZH0056,,,,,,,,,,,,,0,,,,,S,sols,,,250,-2.068888,48.043799
2019-531287,2019-03-29,000001,Vente,30000,,,LE GACEL,B197,35380,35305,Saint-Péran,35,,,35305000ZH0118,,,,,,,,,,,,,0,,,,,S,sols,,,40,-2.067465,48.04408
2019-531287,2019-03-29,000001,Vente,30000,,,LE GACEL,B197,35380,35305,Saint-Péran,35,,,35305000ZH0118,,,,,,,,,,,,,0,,,,,E,eaux,ETANG,Etangs,2120,-2.067465,48.04408
2019-531287,2019-03-29,000001,Vente,30000,,,LE GACEL,B197,35380,35305,Saint-Péran,35,,,35305000ZH0118,,,,,,,,,,,,,0,,,,,AG,terrains d'agrément,,,3408,-2.067465,48.04408
2019-533003,2019-07-18,000001,Vente,214890,7,,CLOS DES PRISES,0064,35380,35305,Saint-Péran,35,,,35305000ZC0099,,,,,,,,,,,,,0,1,Maison,153,5,S,sols,,,1053,-2.056126,48.056602
2019-533209,2019-07-05,000001,Vente,232000,9,C,RUE DE LA FORET,0048,35380,35305,Saint-Péran,35,,,35305000AB0114,,,,,,,,,,,,,0,1,Maison,140,6,S,sols,,,724,-2.059795,48.05442
2019-535257,2019-11-20,000001,Vente,23000,3,,RUE SAINTE EMERANCE,0067,35380,35305,Saint-Péran,35,,,35305000AB0134,,,,,,,,,,,,,0,1,Maison,25,1,S,sols,,,267,-2.056065,48.054178
