id_mutation,date_mutation,numero_disposition,nature_mutation,valeur_fonciere,adresse_numero,adresse_suffixe,adresse_nom_voie,adresse_code_voie,code_postal,code_commune,nom_commune,code_departement,ancien_code_commune,ancien_nom_commune,id_parcelle,ancien_id_parcelle,numero_volume,lot1_numero,lot1_surface_carrez,lot2_numero,lot2_surface_carrez,lot3_numero,lot3_surface_carrez,lot4_numero,lot4_surface_carrez,lot5_numero,lot5_surface_carrez,nombre_lots,code_type_local,type_local,surface_reelle_bati,nombre_pieces_principales,code_nature_culture,nature_culture,code_nature_culture_speciale,nature_culture_speciale,surface_terrain,longitude,latitude
2019-540863,2019-01-02,000001,Vente,105000,,,LE GRAND CLOS,B616,35190,35337,Tinténiac,35,,,353370000C1388,,,,,,,,,,,,,0,,,,,AB,terrains a bâtir,,,304,-1.825577,48.334015
2019-540863,2019-01-02,000001,Vente,105000,,,LE GRAND CLOS,B616,35190,35337,Tinténiac,35,,,353370000C1389,,,,,,,,,,,,,0,,,,,AB,terrains a bâtir,,,988,-1.825816,48.334198
2019-540863,2019-01-02,000001,Vente,105000,,,LE GRAND CLOS,B616,35190,35337,Tinténiac,35,,,353370000C1390,,,,,,,,,,,,,0,,,,,AB,terrains a bâtir,,,431,-1.825644,48.334471
2019-540863,2019-01-02,000001,Vente,105000,,,LE GRAND CLOS,B616,35190,35337,Tinténiac,35,,,353370000C1391,,,,,,,,,,,,,0,,,,,AB,terrains a bâtir,,,454,-1.825492,48.334354
2019-540863,2019-01-02,000001,Vente,105000,,,LE GRAND CLOS,B616,35190,35337,Tinténiac,35,,,353370000C1392,,,,,,,,,,,,,0,,,,,AB,terrains a bâtir,,,371,-1.825233,48.334444
2019-540863,2019-01-02,000001,Vente,105000,,,LE GRAND CLOS,B616,35190,35337,Tinténiac,35,,,353370000C1393,,,,,,,,,,,,,0,,,,,AB,terrains a bâtir,,,466,-1.825021,48.334584
2019-540863,2019-01-02,000001,Vente,105000,,,LE GRAND CLOS,B616,35190,35337,Tinténiac,35,,,353370000C1394,,,,,,,,,,,,,0,,,,,AB,terrains a bâtir,,,602,-1.825268,48.334786
2019-540863,2019-01-02,000001,Vente,105000,,,LE GRAND CLOS,B616,35190,35337,Tinténiac,35,,,353370000C1395,,,,,,,,,,,,,0,,,,,AB,terrains a bâtir,,,499,-1.825092,48.334784
2019-540863,2019-01-02,000001,Vente,105000,,,LE GRAND CLOS,B616,35190,35337,Tinténiac,35,,,353370000C1396,,,,,,,,,,,,,0,,,,,AB,terrains a bâtir,,,445,-1.824908,48.335054
2019-540863,2019-01-02,000001,Vente,105000,,,LE GRAND CLOS,B616,35190,35337,Tinténiac,35,,,353370000C1397,,,,,,,,,,,,,0,,,,,AB,terrains a bâtir,,,332,-1.824824,48.334944
2019-540863,2019-01-02,000001,Vente,105000,,,LE GRAND CLOS,B616,35190,35337,Tinténiac,35,,,353370000C1398,,,,,,,,,,,,,0,,,,,AB,terrains a bâtir,,,336,-1.824759,48.33483
2019-540863,2019-01-02,000001,Vente,105000,,,LE GRAND CLOS,B616,35190,35337,Tinténiac,35,,,353370000C1399,,,,,,,,,,,,,0,,,,,AB,terrains a bâtir,,,353,-1.824693,48.334715
2019-540863,2019-01-02,000001,Vente,105000,,,LE GRAND CLOS,B616,35190,35337,Tinténiac,35,,,353370000C1400,,,,,,,,,,,,,0,,,,,AB,terrains a bâtir,,,382,-1.824634,48.33458
2019-540863,2019-01-02,000001,Vente,105000,,,LE GRAND CLOS,B616,35190,35337,Tinténiac,35,,,353370000C1401,,,,,,,,,,,,,0,,,,,AB,terrains a bâtir,,,350,-1.824527,48.334472
2019-540863,2019-01-02,000001,Vente,105000,,,LE GRAND CLOS,B616,35190,35337,Tinténiac,35,,,353370000C1402,,,,,,,,,,,,,0,,,,,AB,terrains a bâtir,,,382,-1.824402,48.334315
2019-540863,2019-01-02,000001,Vente,105000,,,LE GRAND CLOS,B616,35190,35337,Tinténiac,35,,,353370000C1403,,,,,,,,,,,,,0,,,,,AB,terrains a bâtir,,,416,-1.824316,48.334152
2019-540863,2019-01-02,000001,Vente,105000,,,LE GRAND CLOS,B616,35190,35337,Tinténiac,35,,,353370000C1404,,,,,,,,,,,,,0,,,,,AB,terrains a bâtir,,,330,-1.824469,48.334071
2019-540863,2019-01-02,000001,Vente,105000,,,LE GRAND CLOS,B616,35190,35337,Tinténiac,35,,,353370000C1405,,,,,,,,,,,,,0,,,,,AB,terrains a bâtir,,,330,-1.824643,48.333979
2019-540863,2019-01-02,000001,Vente,105000,,,LE GRAND CLOS,B616,35190,35337,Tinténiac,35,,,353370000C1406,,,,,,,,,,,,,0,,,,,AB,terrains a bâtir,,,336,-1.824748,48.33416
2019-540863,2019-01-02,000001,Vente,105000,,,LE GRAND CLOS,B616,35190,35337,Tinténiac,35,,,353370000C1407,,,,,,,,,,,,,0,,,,,AB,terrains a bâtir,,,336,-1.824921,48.334069
2019-540863,2019-01-02,000001,Vente,105000,,,LE GRAND CLOS,B616,35190,35337,Tinténiac,35,,,353370000C1408,,,,,,,,,,,,,0,,,,,AB,terrains a bâtir,,,328,-1.825111,48.334002
2019-540863,2019-01-02,000001,Vente,105000,,,LE GRAND CLOS,B616,35190,35337,Tinténiac,35,,,353370000C1409,,,,,,,,,,,,,0,,,,,AB,terrains a bâtir,,,363,-1.825234,48.334138
2019-540863,2019-01-02,000001,Vente,105000,,,LE GRAND CLOS,B616,35190,35337,Tinténiac,35,,,353370000C1410,,,,,,,,,,,,,0,,,,,AB,terrains a bâtir,,,361,-1.825036,48.334284
2019-540863,2019-01-02,000001,Vente,105000,,,LE GRAND CLOS,B616,35190,35337,Tinténiac,35,,,353370000C1411,,,,,,,,,,,,,0,,,,,AB,terrains a bâtir,,,372,-1.8248,48.334366
2019-540863,2019-01-02,000001,Vente,105000,,,LE GRAND CLOS,B616,35190,35337,Tinténiac,35,,,353370000C1412,,,,,,,,,,,,,0,,,,,AG,terrains d'agrément,,,601,-1.825531,48.334683
2019-540863,2019-01-02,000001,Vente,105000,,,LE GRAND CLOS,B616,35190,35337,Tinténiac,35,,,353370000C1413,,,,,,,,,,,,,0,,,,,S,sols,,,2257,-1.825138,48.334331
2019-540863,2019-01-02,000001,Vente,105000,,,LE GRAND CLOS,B616,35190,35337,Tinténiac,35,,,353370000C1414,,,,,,,,,,,,,0,,,,,S,sols,,,36,-1.825514,48.33428
2019-540863,2019-01-02,000001,Vente,105000,,,LE GRAND CLOS,B616,35190,35337,Tinténiac,35,,,353370000C1415,,,,,,,,,,,,,0,,,,,S,sols,,,40,-1.824923,48.334586
2019-540863,2019-01-02,000001,Vente,105000,,,LE GRAND CLOS,B616,35190,35337,Tinténiac,35,,,353370000C1416,,,,,,,,,,,,,0,,,,,S,sols,,,98,-1.82463,48.33426
2019-540863,2019-01-02,000001,Vente,105000,,,LE GRAND CLOS,B616,35190,35337,Tinténiac,35,,,353370000C1417,,,,,,,,,,,,,0,,,,,AG,terrains d'agrément,,,1400,-1.824882,48.333867
2019-541097,2019-01-28,000001,Vente,65000,5762,,RUE DE LA SAUDRAIS,0580,35190,35337,Tinténiac,35,,,353370000B0414,,,,,,,,,,,,,0,4,Local industriel. commercial ou assimilé,198,0,T,terres,,,1405,,
2019-541097,2019-01-28,000001,Vente,65000,5762,,RUE DE LA SAUDRAIS,0580,35190,35337,Tinténiac,35,,,353370000B0414,,,,,,,,,,,,,0,4,Local industriel. commercial ou assimilé,198,0,S,sols,,,500,,
2019-541103,2019-01-24,000001,Vente,165000,1,,BD VILLIERS DE L ISLE ADAM,0613,35190,35337,Tinténiac,35,,,353370000B0468,,,,,,,,,,,,,0,1,Maison,76,3,S,sols,,,835,-1.840005,48.335266
2019-541111,2019-01-16,000001,Vente,60000,20,B,RUE NATIONALE,0440,35190,35337,Tinténiac,35,,,35337000AB0687,,,1,56.5,,,,,,,,,1,4,Local industriel. commercial ou assimilé,60,0,,,,,,-1.835735,48.328842
2019-541308,2019-02-04,000002,Vente,4800,8,,AV DUGUESCLIN,0220,35190,35337,Tinténiac,35,,,35337000AC0438,,,,,,,,,,,,,0,,,,,S,sols,,,48,-1.832396,48.326425
2019-541311,2019-02-07,000001,Vente,4640,,,LE CLOS PHILIPPAU,B435,35190,35337,Tinténiac,35,,,353370000C1354,,,,,,,,,,,,,0,,,,,AB,terrains a bâtir,,,647,-1.824812,48.331344
2019-541311,2019-02-07,000001,Vente,4640,4,,RUE ADOLPHE ORAIN,0002,35190,35337,Tinténiac,35,,,353370000C1355,,,,,,,,,,,,,0,,,,,S,sols,,,46,,
2019-541311,2019-02-07,000001,Vente,4640,,,LA FAGLINE,B572,35190,35337,Tinténiac,35,,,353370000C1383,,,,,,,,,,,,,0,,,,,T,terres,,,235,-1.826174,48.331082
2019-541312,2019-02-04,000001,Vente,2160,8,,AV DUGUESCLIN,0220,35190,35337,Tinténiac,35,,,35337000AC0439,,,,,,,,,,,,,0,,,,,S,sols,,,27,-1.832135,48.326481
2019-541375,2019-02-13,000001,Vente,31150.45,,,LA HAUTE BIGOTTIERE,B722,35190,35337,Tinténiac,35,,,35337000ZB0058,,,,,,,,,,,,,0,,,,,T,terres,,,6091,,
2019-541432,2019-02-28,000001,Vente,125000,9010,,LE CLOS DE LA METAIRIE,B294,35190,35337,Tinténiac,35,,,35337000ZI0117,,,,,,,,,,,,,0,1,Maison,93,4,T,terres,,,1400,-1.775685,48.32848
2019-541432,2019-02-28,000001,Vente,125000,9010,,LE CLOS DE LA METAIRIE,B294,35190,35337,Tinténiac,35,,,35337000ZI0117,,,,,,,,,,,,,0,1,Maison,93,4,S,sols,,,661,-1.775685,48.32848
2019-541432,2019-02-28,000001,Vente,125000,,,LE CHATELAIN,B143,35190,35337,Tinténiac,35,,,35337000ZI0121,,,,,,,,,,,,,0,,,,,T,terres,,,1194,-1.775333,48.328301
2019-541432,2019-02-28,000001,Vente,125000,,,LE CHATELAIN,B143,35190,35337,Tinténiac,35,,,35337000ZI0122,,,,,,,,,,,,,0,,,,,AB,terrains a bâtir,,,707,-1.776024,48.328255
2019-541432,2019-02-28,000001,Vente,125000,,,LE CHATELAIN,B143,35190,35337,Tinténiac,35,,,35337000ZI0123,,,,,,,,,,,,,0,,,,,S,sols,,,17,-1.775669,48.328288
2019-541432,2019-02-28,000001,Vente,125000,,,LE CHATELAIN,B143,35190,35337,Tinténiac,35,,,35337000ZI0124,,,,,,,,,,,,,0,,,,,S,sols,,,128,-1.776043,48.328326
2019-541432,2019-02-28,000001,Vente,125000,,,LE CHATELAIN,B143,35190,35337,Tinténiac,35,,,35337000ZI0125,,,,,,,,,,,,,0,,,,,S,sols,,,957,-1.77621,48.328274
2019-541432,2019-02-28,000001,Vente,125000,,,LE CHATELAIN,B143,35190,35337,Tinténiac,35,,,35337000ZI0126,,,,,,,,,,,,,0,,,,,T,terres,,,194,-1.776239,48.32797
2019-541432,2019-02-28,000001,Vente,125000,,,LE CHATELAIN,B143,35190,35337,Tinténiac,35,,,35337000ZI0127,,,,,,,,,,,,,0,,,,,T,terres,,,2839,-1.775723,48.327888
2019-541472,2019-02-15,000001,Vente,98000,40,,AV DUGUESCLIN,0220,35190,35337,Tinténiac,35,,,35337000AC0098,,,,,,,,,,,,,0,1,Maison,69,4,S,sols,,,413,-1.830467,48.323363
2019-541481,2019-02-14,000002,Vente terrain à bâtir,324,,,LE GRAND CLOS,B616,35190,35337,Tinténiac,35,,,35337000AD0500,,,,,,,,,,,,,0,,,,,S,sols,,,27,-1.842175,48.331745
2019-541507,2019-03-07,000001,Vente,11061.6,,,LA MORANDAIS,B825,35190,35337,Tinténiac,35,,,35337000ZO0147,,,,,,,,,,,,,0,,,,,AB,terrains a bâtir,,,419,-1.820286,48.30563
2019-541559,2019-02-28,000001,Vente,105000,8,,ALL DU PROGRES,0510,35190,35337,Tinténiac,35,,,35337000AB0727,,,58,,,,,,,,,,1,3,Dépendance,,0,,,,,,-1.831955,48.327888
2019-541559,2019-02-28,000001,Vente,105000,6,,RUE FELIX TROCHU,0325,35190,35337,Tinténiac,35,,,35337000AB0775,,,37,49.9,,,,,,,,,1,2,Appartement,50,2,,,,,,-1.831867,48.327684
2019-541559,2019-02-28,000001,Vente,105000,6,,RUE FELIX TROCHU,0325,35190,35337,Tinténiac,35,,,35337000AB0775,,,53,,,,,,,,,,1,3,Dépendance,,0,,,,,,-1.831867,48.327684
2019-541571,2019-02-22,000001,Vente,22000,,,LAUNAY SOUS HEDE,B800,35190,35337,Tinténiac,35,,,35337000ZM0054,,,,,,,,,,,,,0,,,,,P,prés,,,1420,-1.80578,48.303049
2019-541571,2019-02-22,000001,Vente,22000,,,LAUNAY SOUS HEDE,B800,35190,35337,Tinténiac,35,,,35337000ZM0055,,,,,,,,,,,,,0,,,,,P,prés,,,2732,-1.806033,48.302905
2019-541571,2019-02-22,000001,Vente,22000,,,LAUNAY SOUS HEDE,B800,35190,35337,Tinténiac,35,,,35337000ZM0056,,,,,,,,,,,,,0,,,,,P,prés,,,3180,-1.806449,48.302731
2019-541571,2019-02-22,000001,Vente,22000,,,LA NOE MAILLARD,B835,35190,35337,Tinténiac,35,,,35337000ZM0074,,,,,,,,,,,,,0,,,,,T,terres,,,2247,-1.810007,48.305301
2019-541571,2019-02-22,000001,Vente,22000,,,LA NOE MAILLARD,B835,35190,35337,Tinténiac,35,,,35337000ZM0075,,,,,,,,,,,,,0,,,,,T,terres,,,11524,-1.810336,48.306019
2019-541571,2019-02-22,000001,Vente,22000,,,LE PAVE,B856,35190,35337,Tinténiac,35,,,35337000ZM0115,,,,,,,,,,,,,0,,,,,T,terres,,,3214,-1.811508,48.300263
2019-541571,2019-02-22,000001,Vente,22000,,,LE PAVE,B856,35190,35337,Tinténiac,35,,,35337000ZM0115,,,,,,,,,,,,,0,,,,,P,prés,,,13624,-1.811508,48.300263
2019-541571,2019-02-22,000001,Vente,22000,,,LA COUR BOIZARD,B494,35190,35337,Tinténiac,35,,,35337000ZO0133,,,,,,,,,,,,,0,,,,,VE,vergers,CIDRE,Cidre,1127,-1.821715,48.307253
2019-541571,2019-02-22,000001,Vente,22000,,,LA COUR BOIZARD,B494,35190,35337,Tinténiac,35,,,35337000ZO0133,,,,,,,,,,,,,0,,,,,T,terres,,,13657,-1.821715,48.307253
2019-541590,2019-02-22,000001,Vente,225550,47,,RUE DU CLOS DE JUSTICE,0116,35190,35337,Tinténiac,35,,,353370000C1324,,,,,,,,,,,,,0,1,Maison,96,5,S,sols,,,568,-1.823292,48.332077
2019-541602,2019-02-27,000001,Vente,,1,,QUAI DE LISTERNAC,0410,35190,35337,Tinténiac,35,,,35337000AB0112,,,,,,,,,,,,,0,1,Maison,68,3,S,sols,,,670,-1.831772,48.330749
2019-541602,2019-02-27,000001,Vente,,,,RUE DU PONT A L ABBESSE,0480,35190,35337,Tinténiac,35,,,35337000AB0416,,,,,,,,,,,,,0,,,,,J,jardins,POTAG,Jardin potager,145,-1.831893,48.330898
2019-541602,2019-02-27,000001,Vente,,,,LE FRICHE,B596,35190,35337,Tinténiac,35,,,35337000AC0069,,,,,,,,,,,,,0,,,,,B,bois,,,1735,-1.827929,48.32703
2019-541602,2019-02-27,000001,Vente,,,,PONT A L ABBESSE,B981,35190,35337,Tinténiac,35,,,353370000B0129,,,,,,,,,,,,,0,,,,,J,jardins,,,684,-1.831749,48.331603
2019-541602,2019-02-27,000001,Vente,,,,TERRAIN DU CANAL,C216,35190,35337,Tinténiac,35,,,353370000B0344,,,,,,,,,,,,,0,,,,,B,bois,,,6840,-1.837219,48.338075
2019-541602,2019-02-27,000001,Vente,,,,TERRAIN DU CANAL,C216,35190,35337,Tinténiac,35,,,353370000B0345,,,,,,,,,,,,,0,,,,,B,bois,,,3500,-1.836781,48.338309
2019-541602,2019-02-27,000001,Vente,,,,LA MOUCHERIE,B830,35190,35337,Tinténiac,35,,,353370000C0166,,,,,,,,,,,,,0,,,,,J,jardins,,,955,-1.814433,48.321524
2019-541602,2019-02-27,000001,Vente,,5188,,LA MOUCHERIE,B830,35190,35337,Tinténiac,35,,,353370000C0167,,,,,,,,,,,,,0,1,Maison,120,4,S,sols,,,308,-1.81451,48.321493
2019-541603,2019-02-27,000001,Vente terrain à bâtir,432,,,LE GRAND CLOS,B616,35190,35337,Tinténiac,35,,,35337000AD0501,,,,,,,,,,,,,0,,,,,S,sols,,,36,-1.842286,48.331844
2019-541650,2019-02-28,000001,Vente,83000,,,LE CLOS DE DERRIERE,B266,35190,35337,Tinténiac,35,,,353370000D1017,,,,,,,,,,,,,0,,,,,T,terres,,,1000,-1.822873,48.308319
2019-541650,2019-02-28,000001,Vente,83000,,,LE CLOS DE DERRIERE,B266,35190,35337,Tinténiac,35,,,353370000D1019,,,,,,,,,,,,,0,,,,,T,terres,,,28,-1.822602,48.308268
2019-541711,2019-03-01,000001,Vente,188640,1,,RUE CHARLES LE GOFFIC,0401,35190,35337,Tinténiac,35,,,353370000B0996,,,,,,,,,,,,,0,1,Maison,86,4,S,sols,,,462,-1.843161,48.334355
2019-541736,2019-03-01,000001,Vente,30000,,,LA COUR AU COINTRE,B492,35190,35337,Tinténiac,35,,,35337000AC0140,,,,,,,,,,,,,0,,,,,J,jardins,POTAG,Jardin potager,8,-1.830346,48.32598
2019-541736,2019-03-01,000001,Vente,30000,,,AV DUGUESCLIN,0220,35190,35337,Tinténiac,35,,,35337000AC0151,,,,,,,,,,,,,0,,,,,J,jardins,POTAG,Jardin potager,316,-1.830431,48.325905
2019-541808,2019-03-12,000001,Vente,217500,9000,,LA BASSE MADELAINE,B019,35190,35337,Tinténiac,35,,,353370000B0982,,,,,,,,,,,,,0,1,Maison,97,4,S,sols,,,716,-1.847223,48.338575
2019-541869,2019-03-25,000001,Vente,188640,12,,RUE DE TREFENDEL,0598,35190,35337,Tinténiac,35,,,353370000B1061,,,,,,,,,,,,,0,1,Maison,101,5,S,sols,,,321,-1.841224,48.335723
2019-541876,2019-03-29,000001,Vente terrain à bâtir,46080,,,LE TERDAIS,C213,35190,35337,Tinténiac,35,,,353370000B1185,,,,,,,,,,,,,0,,,,,AB,terrains a bâtir,,,384,-1.843543,48.333357
2019-541878,2019-03-14,000001,Vente,28392,,,LA COUR BOIZARD,B494,35190,35337,Tinténiac,35,,,35337000ZO0170,,,,,,,,,,,,,0,,,,,T,terres,,,338,-1.823363,48.308268
2019-541879,2019-03-14,000002,Vente,71820,,,LA COUR BOIZARD,B494,35190,35337,Tinténiac,35,,,35337000ZO0173,,,,,,,,,,,,,0,,,,,T,terres,,,855,-1.823719,48.308191
2019-542145,2019-04-11,000001,Vente,3000,,,LA PRAIRIE DU PONTIOU,C031,35190,35337,Tinténiac,35,,,353370000B0264,,,,,,,,,,,,,0,,,,,P,prés,,,9300,-1.826377,48.324906
2019-542172,2019-03-28,000001,Vente,67223,,,RUE JEAN-JULIEN LEMORDANT,0407,35190,35337,Tinténiac,35,,,35337000AC0417,,,,,,,,,,,,,0,,,,,S,sols,,,250,-1.835844,48.327233
2019-542260,2019-04-04,000001,Vente,63690,6,,LA REINAIS,C182,35190,35337,Tinténiac,35,,,35337000AC0232,,,,,,,,,,,,,0,1,Maison,83,4,S,sols,,,288,-1.832826,48.323318
2019-542265,2019-04-05,000001,Vente,160000,7,,LE BAS CHAMP,B010,35190,35337,Tinténiac,35,,,35337000AC0011,,,,,,,,,,,,,0,1,Maison,48,3,S,sols,,,345,-1.833972,48.327006
2019-542294,2019-03-29,000001,Vente,36500,,,RUE NATIONALE,0440,35190,35337,Tinténiac,35,,,35337000AB0471,,,,,,,,,,,,,0,,,,,J,jardins,POTAG,Jardin potager,285,-1.837322,48.32859
2019-542294,2019-03-29,000001,Vente,36500,5491,,RUE NATIONALE,0440,35190,35337,Tinténiac,35,,,35337000AB0472,,,,,,,,,,,,,0,1,Maison,52,3,S,sols,,,129,-1.837412,48.328793
2019-542295,2019-04-10,000001,Vente,87000,2,,RUE DES FRANCAIS LIBRES,0364,35190,35337,Tinténiac,35,,,35337000AD0325,,,33,,5,46.9,,,,,,,2,4,Local industriel. commercial ou assimilé,46,0,,,,,,-1.841324,48.327189
2019-542347,2019-04-16,000002,Vente,47520,,,LA MORANDAIS,B825,35190,35337,Tinténiac,35,,,35337000ZO0174,,,,,,,,,,,,,0,,,,,AB,terrains a bâtir,,,1800,-1.820177,48.305503
2019-542431,2019-04-29,000001,Vente,6300,,,LA POULINIERE,B993,35190,35337,Tinténiac,35,,,35337000ZM0030,,,,,,,,,,,,,0,,,,,T,terres,,,12608,-1.804648,48.30627
2019-542431,2019-04-29,000001,Vente,6300,,,LA POULINIERE,B993,35190,35337,Tinténiac,35,,,35337000ZM0030,,,,,,,,,,,,,0,,,,,T,terres,,,3070,-1.804648,48.30627
2019-542446,2019-04-29,000002,Vente,170000,5111,,ALL DE BEL AIR,0072,35190,35337,Tinténiac,35,,,353370000C0236,,,,,,,,,,,,,0,3,Dépendance,,0,S,sols,,,145,-1.827703,48.333025
2019-542446,2019-04-29,000002,Vente,170000,5111,,ALL DE BEL AIR,0072,35190,35337,Tinténiac,35,,,353370000C0236,,,,,,,,,,,,,0,1,Maison,155,7,S,sols,,,145,-1.827703,48.333025
2019-542446,2019-04-29,000002,Vente,170000,,,LA MAISON BLANCHE,B809,35190,35337,Tinténiac,35,,,353370000C1418,,,,,,,,,,,,,0,,,,,J,jardins,POTAG,Jardin potager,956,-1.827598,48.333052
2019-542491,2019-05-02,000001,Vente,72096,1,,RUE JEAN-JULIEN LEMORDANT,0407,35190,35337,Tinténiac,35,,,35337000AC0421,,,,,,,,,,,,,0,1,Maison,49,2,S,sols,,,280,-1.834861,48.327158
2019-542491,2019-05-02,000001,Vente,72096,1,,RUE JEAN-JULIEN LEMORDANT,0407,35190,35337,Tinténiac,35,,,35337000AC0421,,,,,,,,,,,,,0,1,Maison,79,4,S,sols,,,280,-1.834861,48.327158
2019-542491,2019-05-02,000001,Vente,72096,1,,RUE JEAN-JULIEN LEMORDANT,0407,35190,35337,Tinténiac,35,,,35337000AC0421,,,,,,,,,,,,,0,1,Maison,49,2,S,sols,,,280,-1.834861,48.327158
2019-542672,2019-05-02,000001,Vente,184400,8,,RUE ANGELE VANNIER,0044,35190,35337,Tinténiac,35,,,353370000B0770,,,,,,,,,,,,,0,1,Maison,114,5,S,sols,,,487,-1.839993,48.333058
2019-542727,2019-05-14,000001,Vente,200000,18,,AV DES TRENTE,0600,35190,35337,Tinténiac,35,,,35337000AD0382,,,,,,,,,,,,,0,1,Maison,81,4,S,sols,,,937,-1.84064,48.328426
2019-542868,2019-05-28,000001,Vente,195000,26,,LOT COM DE LA CROIX GILLET,A010,35190,35337,Tinténiac,35,,,353370000B0679,,,,,,,,,,,,,0,1,Maison,120,4,S,sols,,,494,-1.846844,48.325937
2019-542873,2019-05-22,000001,Vente,175000,8,,RUE PIERRE LEMAITRE,0455,35190,35337,Tinténiac,35,,,353370000B0689,,,,,,,,,,,,,0,1,Maison,103,6,S,sols,,,478,-1.845304,48.326211
2019-542962,2019-05-28,000001,Vente,1000,,,LE PONT A L ABBESSE,B982,35190,35337,Tinténiac,35,,,353370000C0213,,,,,,,,,,,,,0,,,,,BT,taillis simples,,,279,-1.830555,48.330431
2019-543100,2019-06-03,000001,Vente,230000,,,ROUYON,C195,35190,35337,Tinténiac,35,,,35337000ZK0043,,,,,,,,,,,,,0,,,,,S,sols,,,410,-1.790758,48.318999
2019-543100,2019-06-03,000001,Vente,230000,5162,,ROUYON,C195,35190,35337,Tinténiac,35,,,35337000ZK0044,,,,,,,,,,,,,0,1,Maison,120,5,S,sols,,,362,-1.790634,48.318866
2019-543100,2019-06-03,000001,Vente,230000,5162,,ROUYON,C195,35190,35337,Tinténiac,35,,,35337000ZK0044,,,,,,,,,,,,,0,1,Maison,120,5,P,prés,,,287,-1.790634,48.318866
2019-543177,2019-06-24,000001,Vente,46500,,,LE GRAND CLOS,B616,35190,35337,Tinténiac,35,,,353370000C1411,,,,,,,,,,,,,0,,,,,AB,terrains a bâtir,,,372,-1.8248,48.334366
2019-543180,2019-06-24,000001,Vente,57385,,,LE GRAND CLOS,B616,35190,35337,Tinténiac,35,,,353370000C1395,,,,,,,,,,,,,0,,,,,AB,terrains a bâtir,,,499,-1.825092,48.334784
2019-543219,2019-06-11,000001,Vente,85000,,,LE CLOS DES GRANGES,B325,35190,35337,Tinténiac,35,,,353370000B1198,,,,,,,,,,,,,0,,,,,AB,terrains a bâtir,,,672,-1.838797,48.326145
2019-543247,2019-06-24,000001,Vente,42000,,,LE GRAND CLOS,B616,35190,35337,Tinténiac,35,,,353370000C1406,,,,,,,,,,,,,0,,,,,AB,terrains a bâtir,,,336,-1.824748,48.33416
2019-543271,2019-06-27,000001,Vente,59049,,,LE GRAND CLOS,B616,35190,35337,Tinténiac,35,,,353370000C1389,,,,,,,,,,,,,0,,,,,AB,terrains a bâtir,,,988,-1.825816,48.334198
2019-543345,2019-06-28,000001,Vente,81000,,,LE CLOS PETEL,B434,35190,35337,Tinténiac,35,,,353370000C1002,,,,,,,,,,,,,0,,,,,T,terres,,,1581,-1.827111,48.334107
2019-543368,2019-06-18,000001,Vente terrain à bâtir,96,,,LE GRAND CLOS,B616,35190,35337,Tinténiac,35,,,35337000AD0499,,,,,,,,,,,,,0,,,,,S,sols,,,8,-1.842086,48.331644
2019-543370,2019-06-20,000001,Vente,67143,,,RUE JEAN-JULIEN LEMORDANT,0407,35190,35337,Tinténiac,35,,,35337000AC0416,,,,,,,,,,,,,0,,,,,S,sols,,,246,-1.83604,48.327209
2019-543371,2019-06-21,000001,Vente,84500,5160,,ROUYON,C195,35190,35337,Tinténiac,35,,,35337000ZI0133,,,,,,,,,,,,,0,1,Maison,104,4,J,jardins,POTAG,Jardin potager,569,-1.789805,48.318656
2019-543371,2019-06-21,000001,Vente,84500,5160,,ROUYON,C195,35190,35337,Tinténiac,35,,,35337000ZI0133,,,,,,,,,,,,,0,1,Maison,104,4,S,sols,,,500,-1.789805,48.318656
2019-543375,2019-06-12,000001,Vente,104000,32,,AV DUGUESCLIN,0220,35190,35337,Tinténiac,35,,,35337000AC0124,,,,,,,,,,,,,0,1,Maison,76,4,S,sols,,,371,-1.830736,48.323971
2019-543396,2019-07-03,000001,Vente,47750,,,LE GRAND CLOS,B616,35190,35337,Tinténiac,35,,,353370000C1400,,,,,,,,,,,,,0,,,,,AB,terrains a bâtir,,,382,-1.824634,48.33458
2019-543399,2019-06-26,000001,Vente,41000,,,LE GRAND CLOS,B616,35190,35337,Tinténiac,35,,,353370000C1408,,,,,,,,,,,,,0,,,,,AB,terrains a bâtir,,,328,-1.825111,48.334002
2019-543403,2019-06-26,000001,Vente,45250,,,LE GRAND CLOS,B616,35190,35337,Tinténiac,35,,,353370000C1409,,,,,,,,,,,,,0,,,,,AB,terrains a bâtir,,,363,-1.825234,48.334138
2019-543429,2019-06-26,000001,Vente,60600,19,,RUE DU PUITS ROBIDOU,0540,35190,35337,Tinténiac,35,,,35337000AB0443,,,,,,,,,,,,,0,4,Local industriel. commercial ou assimilé,114,0,S,sols,,,203,-1.832209,48.327486
2019-543429,2019-06-26,000001,Vente,60600,19,,RUE DU PUITS ROBIDOU,0540,35190,35337,Tinténiac,35,,,35337000AB0443,,,,,,,,,,,,,0,1,Maison,48,2,S,sols,,,203,-1.832209,48.327486
2019-543429,2019-06-26,000001,Vente,60600,,,RUE DU PUITS ROBIDOU,0540,35190,35337,Tinténiac,35,,,35337000AB0749,,,,,,,,,,,,,0,,,,,S,sols,,,5,-1.832189,48.327532
2019-543429,2019-06-26,000001,Vente,60600,2,,RUE FELIX TROCHU,0325,35190,35337,Tinténiac,35,,,35337000AB0776,,,,,,,,,,,,,0,,,,,S,sols,,,1,-1.832128,48.327566
2019-543429,2019-06-26,000001,Vente,60600,2,,RUE FELIX TROCHU,0325,35190,35337,Tinténiac,35,,,35337000AB0777,,,,,,,,,,,,,0,,,,,S,sols,,,1,-1.832149,48.32756
2019-543429,2019-06-26,000001,Vente,60600,,,RUE DU PUITS ROBIDOU,0540,35190,35337,Tinténiac,35,,,35337000AB0779,,,,,,,,,,,,,0,,,,,S,sols,,,5,-1.832173,48.327544
2019-543429,2019-06-26,000001,Vente,60600,,,RUE DU PUITS ROBIDOU,0540,35190,35337,Tinténiac,35,,,35337000AB0780,,,,,,,,,,,,,0,,,,,S,sols,,,1,-1.832153,48.327545
2019-543493,2019-07-08,000001,Vente,44125,,,LE GRAND CLOS,B616,35190,35337,Tinténiac,35,,,353370000C1399,,,,,,,,,,,,,0,,,,,AB,terrains a bâtir,,,353,-1.824693,48.334715
2019-543532,2019-06-25,000001,Vente,195000,18,,RUE DE TREFENDEL,0598,35190,35337,Tinténiac,35,,,353370000B1066,,,,,,,,,,,,,0,1,Maison,121,5,S,sols,,,301,-1.841719,48.335811
2019-543532,2019-06-25,000001,Vente,195000,,,LE CLOS DU PUITS,B367,35190,35337,Tinténiac,35,,,353370000B1067,,,,,,,,,,,,,0,,,,,S,sols,,,265,-1.841746,48.33602
2019-543537,2019-06-25,000002,Vente,400,,,LE CLOS DE LA SALLE VERTE,B305,35190,35337,Tinténiac,35,,,35337000AB0805,,,,,,,,,,,,,0,,,,,S,sols,,,7,-1.831774,48.328621
2019-543544,2019-07-01,000002,Vente,744,,,LA REINAIS,C182,35190,35337,Tinténiac,35,,,353370000B1201,,,,,,,,,,,,,0,,,,,S,sols,,,62,-1.830438,48.322775
2019-543683,2019-07-12,000001,Vente,4800,,,TRIGNOUX,C232,35190,35337,Tinténiac,35,,,35337000ZE0019,,,,,,,,,,,,,0,,,,,T,terres,,,7700,-1.794679,48.326196
2019-543691,2019-07-11,000001,Vente,49565,,,LE GRAND CLOS,B616,35190,35337,Tinténiac,35,,,353370000C1390,,,,,,,,,,,,,0,,,,,AB,terrains a bâtir,,,431,-1.825644,48.334471
2019-543743,2019-07-25,000001,Vente,215000,9,,RUE ADOLPHE ORAIN,0002,35190,35337,Tinténiac,35,,,353370000C1347,,,,,,,,,,,,,0,1,Maison,84,4,S,sols,,,406,-1.826525,48.333725
2019-543744,2019-07-24,000001,Vente,168000,22,,RUE DE TREFENDEL,0598,35190,35337,Tinténiac,35,,,353370000B1071,,,,,,,,,,,,,0,1,Maison,104,5,S,sols,,,533,-1.841957,48.33561
2019-543756,2019-07-23,000001,Vente,45000,8,,RUE NATIONALE,0440,35190,35337,Tinténiac,35,,,35337000AB0475,,,,,,,,,,,,,0,1,Maison,48,2,S,sols,,,409,-1.837002,48.328771