id_mutation,date_mutation,numero_disposition,nature_mutation,valeur_fonciere,adresse_numero,adresse_suffixe,adresse_nom_voie,adresse_code_voie,code_postal,code_commune,nom_commune,code_departement,ancien_code_commune,ancien_nom_commune,id_parcelle,ancien_id_parcelle,numero_volume,lot1_numero,lot1_surface_carrez,lot2_numero,lot2_surface_carrez,lot3_numero,lot3_surface_carrez,lot4_numero,lot4_surface_carrez,lot5_numero,lot5_surface_carrez,nombre_lots,code_type_local,type_local,surface_reelle_bati,nombre_pieces_principales,code_nature_culture,nature_culture,code_nature_culture_speciale,nature_culture_speciale,surface_terrain,longitude,latitude
2019-549161,2019-02-15,000001,Vente,71000,,,LA GRANDE PIECE,B214,36800,36106,Luzeret,36,,,361060000E0304,,,,,,,,,,,,,0,,,,,T,terres,,,9249,1.396558,46.541362
2019-549161,2019-02-15,000001,Vente,71000,,,LE CHAMP DU MOULIN,B109,36800,36106,Luzeret,36,,,361060000F0051,,,,,,,,,,,,,0,,,,,BP,peupleraies,,,2326,1.394853,46.542136
2019-549161,2019-02-15,000001,Vente,71000,,,LE CHAMP DU MOULIN,B109,36800,36106,Luzeret,36,,,361060000F0051,,,,,,,,,,,,,0,,,,,P,prés,,,6674,1.394853,46.542136
2019-549161,2019-02-15,000001,Vente,71000,,,LE CHAMP DU MOULIN,B109,36800,36106,Luzeret,36,,,361060000F0051,,,,,,,,,,,,,0,,,,,P,prés,,,6675,1.394853,46.542136
2019-549161,2019-02-15,000001,Vente,71000,,,LE CHAMP DU MOULIN,B109,36800,36106,Luzeret,36,,,361060000F0052,,,,,,,,,,,,,0,,,,,T,terres,,,13480,1.396715,46.542217
2019-549161,2019-02-15,000001,Vente,71000,,,LE CHAMP DU MOULIN,B109,36800,36106,Luzeret,36,,,361060000F0053,,,,,,,,,,,,,0,,,,,T,terres,,,6625,1.395713,46.541458
2019-549161,2019-02-15,000001,Vente,71000,4,,RTE DE CHAZELET,0013,36800,36106,Luzeret,36,,,361060000F0056,,,,,,,,,,,,,0,4,Local industriel. commercial ou assimilé,40,0,S,sols,,,595,1.39385,46.540796
2019-549161,2019-02-15,000001,Vente,71000,4,,RTE DE CHAZELET,0013,36800,36106,Luzeret,36,,,361060000F0056,,,,,,,,,,,,,0,1,Maison,115,6,S,sols,,,595,1.39385,46.540796
2019-549161,2019-02-15,000001,Vente,71000,,,LE BOURG,B032,36800,36106,Luzeret,36,,,361060000F0080,,,,,,,,,,,,,0,,,,,J,jardins,,,825,1.393462,46.541247
2019-549161,2019-02-15,000001,Vente,71000,,,LE BOURG,B032,36800,36106,Luzeret,36,,,361060000F0216,,,,,,,,,,,,,0,,,,,S,sols,,,18,1.393651,46.540789
2019-549161,2019-02-15,000001,Vente,71000,,,LE BOURG,B032,36800,36106,Luzeret,36,,,361060000F0258,,,,,,,,,,,,,0,,,,,T,terres,,,340,1.39412,46.541068
2019-549722,2019-03-07,000001,Vente,1783,,,LE TAILLIS MARQUET,B343,36800,36106,Luzeret,36,,,361060000D0118,,,,,,,,,,,,,0,,,,,BS,taillis sous futaie,,,1783,1.380355,46.538108
2019-549732,2019-03-07,000001,Vente,600,,,LE TAILLIS MARQUET,B343,36800,36106,Luzeret,36,,,361060000D0119,,,,,,,,,,,,,0,,,,,BS,taillis sous futaie,,,1777,1.380266,46.537995
2019-549732,2019-03-07,000001,Vente,600,,,LE TAILLIS MARQUET,B343,36800,36106,Luzeret,36,,,361060000D0120,,,,,,,,,,,,,0,,,,,BS,taillis sous futaie,,,1815,1.380045,46.538013
2019-549870,2019-03-23,000001,Vente,20000,,,LA RUE AUBRET,B334,36800,36106,Luzeret,36,,,361060000E0190,,,,,,,,,,,,,0,,,,,J,jardins,,,102,1.391149,46.538254
2019-549870,2019-03-23,000001,Vente,20000,1,,RUE AUBRET,0004,36800,36106,Luzeret,36,,,361060000E0196,,,,,,,,,,,,,0,1,Maison,45,3,S,sols,,,268,1.391357,46.53858
2019-549870,2019-03-23,000001,Vente,20000,,,LA RUE AUBRET,B334,36800,36106,Luzeret,36,,,361060000E0205,,,,,,,,,,,,,0,,,,,S,sols,,,27,1.391841,46.537583
2019-549870,2019-03-23,000001,Vente,20000,,,LA RUE AUBRET,B334,36800,36106,Luzeret,36,,,361060000E0206,,,,,,,,,,,,,0,,,,,J,jardins,,,397,1.391844,46.537502
2019-549870,2019-03-23,000001,Vente,20000,,,LA RUE AUBRET,B334,36800,36106,Luzeret,36,,,361060000E0207,,,,,,,,,,,,,0,,,,,P,prés,,,359,1.391703,46.537347
2019-549988,2019-03-30,000001,Vente,900,,,LE CHAMP TACOGNE,B116,36800,36106,Luzeret,36,,,361060000G0294,,,,,,,,,,,,,0,,,,,T,terres,,,3932,1.425265,46.552717
2019-550111,2019-04-12,000001,Vente,86000,,,LE MAS,B229,36800,36106,Luzeret,36,,,361060000D0285,,,,,,,,,,,,,0,,,,,J,jardins,,,136,1.368427,46.528867
2019-550111,2019-04-12,000001,Vente,86000,,,LE MAS,B229,36800,36106,Luzeret,36,,,361060000D0287,,,,,,,,,,,,,0,,,,,S,sols,,,52,1.368125,46.528708
2019-550111,2019-04-12,000001,Vente,86000,2,,LE MAS,B229,36800,36106,Luzeret,36,,,361060000D0359,,,,,,,,,,,,,0,1,Maison,118,5,S,sols,,,1500,1.368856,46.528229
2019-550111,2019-04-12,000001,Vente,86000,2,,LE MAS,B229,36800,36106,Luzeret,36,,,361060000D0359,,,,,,,,,,,,,0,1,Maison,118,5,T,terres,,,4039,1.368856,46.528229
2019-552742,2019-10-04,000001,Vente,1500,,,LE BOURG,B032,36800,36106,Luzeret,36,,,361060000F0140,,,,,,,,,,,,,0,,,,,T,terres,,,521,1.393193,46.544652
2019-553161,2019-10-17,000001,Vente,500,,,PRE DE LA FONTAINE,B291,36800,36106,Luzeret,36,,,361060000E0172,,,,,,,,,,,,,0,,,,,P,prés,,,1459,1.390168,46.539324
2019-553173,2019-10-17,000001,Vente,40000,5,,LE MAS,B229,36800,36106,Luzeret,36,,,361060000D0289,,,,,,,,,,,,,0,1,Maison,46,3,S,sols,,,429,1.367874,46.528981
2019-553173,2019-10-17,000001,Vente,40000,,,LE MAS,B229,36800,36106,Luzeret,36,,,361060000D0290,,,,,,,,,,,,,0,,,,,J,jardins,,,186,1.367874,46.529228
2019-553173,2019-10-17,000001,Vente,40000,,,LE MAS,B229,36800,36106,Luzeret,36,,,361060000D0298,,,,,,,,,,,,,0,,,,,S,sols,,,87,1.367667,46.529016
2019-553173,2019-10-17,000001,Vente,40000,,,LE MAS,B229,36800,36106,Luzeret,36,,,361060000D0299,,,,,,,,,,,,,0,,,,,S,sols,,,304,1.367746,46.528905
2019-553401,2019-11-05,000001,Vente,3000,,,LE BORDELAIS,B024,36800,36106,Luzeret,36,,,361060000G0271,,,,,,,,,,,,,0,,,,,T,terres,,,7299,1.434676,46.548786
2019-553441,2019-11-06,000006,Echange,,,,LES VIGNES DU BOIS,B359,36800,36106,Luzeret,36,,,361060000D0194,,,,,,,,,,,,,0,,,,,BS,taillis sous futaie,,,338,1.367008,46.533533
2019-553441,2019-11-06,000022,Echange,,,,LES COMBES,B138,36800,36106,Luzeret,36,,,361060000D0406,,,,,,,,,,,,,0,,,,,T,terres,,,1521,1.360665,46.524086
2019-553441,2019-11-06,000032,Echange,,,,LE CHAMP VIANT,B118,36800,36106,Luzeret,36,,,361060000D0166,,,,,,,,,,,,,0,,,,,VI,vignes,,,2461,1.366382,46.531753
2019-553441,2019-11-06,000032,Echange,,,,LES VIGNES DU ROCHEUIL,B360,36800,36106,Luzeret,36,,,361060000D0426,,,,,,,,,,,,,0,,,,,T,terres,,,307,1.361279,46.52596
2019-553530,2019-11-15,000001,Vente,2500,,,LES GOMIATS,B191,36800,36106,Luzeret,36,,,361060000G0086,,,,,,,,,,,,,0,,,,,P,prés,,,3850,1.421885,46.554678
2019-553739,2019-11-28,000001,Vente,,,,LE CHARMELET,B126,36800,36106,Luzeret,36,,,361060000C0039,,,,,,,,,,,,,0,,,,,T,terres,,,4530,1.344185,46.541664
2019-553739,2019-11-28,000001,Vente,,,,LA GALANDERIE,B185,36800,36106,Luzeret,36,,,361060000C0051,,,,,,,,,,,,,0,,,,,T,terres,,,12730,1.349793,46.539188
2019-553739,2019-11-28,000001,Vente,,,,LA GALANDERIE,B185,36800,36106,Luzeret,36,,,361060000C0052,,,,,,,,,,,,,0,,,,,T,terres,,,8160,1.348339,46.539004
2019-553739,2019-11-28,000001,Vente,,,,LA COUTURE,B147,36800,36106,Luzeret,36,,,361060000C0081,,,,,,,,,,,,,0,,,,,T,terres,,,15480,1.344334,46.539092
2019-553739,2019-11-28,000001,Vente,,,,LA COUTURE,B147,36800,36106,Luzeret,36,,,361060000C0082,,,,,,,,,,,,,0,,,,,BT,taillis simples,,,4165,1.344998,46.538819
2019-553739,2019-11-28,000001,Vente,,,,LES PLANTES,B272,36800,36106,Luzeret,36,,,361060000C0095,,,,,,,,,,,,,0,,,,,T,terres,,,2545,1.340706,46.537334
2019-553739,2019-11-28,000001,Vente,,,,LES PLANTES,B272,36800,36106,Luzeret,36,,,361060000C0096,,,,,,,,,,,,,0,,,,,T,terres,,,531,1.34101,46.537335
2019-553739,2019-11-28,000001,Vente,,,,LES PLANTES,B272,36800,36106,Luzeret,36,,,361060000C0097,,,,,,,,,,,,,0,,,,,T,terres,,,287,1.341186,46.537398
2019-553739,2019-11-28,000001,Vente,,,,LES PLANTES,B272,36800,36106,Luzeret,36,,,361060000C0098,,,,,,,,,,,,,0,,,,,T,terres,,,1046,1.34082,46.537044
2019-553739,2019-11-28,000001,Vente,,,,LES PLANTES,B272,36800,36106,Luzeret,36,,,361060000C0099,,,,,,,,,,,,,0,,,,,T,terres,,,1725,1.341218,46.537155
2019-553739,2019-11-28,000001,Vente,,,,LE CHAMP DE PONT,B092,36800,36106,Luzeret,36,,,361060000C0154,,,,,,,,,,,,,0,,,,,T,terres,,,3190,1.338623,46.535898
2019-553739,2019-11-28,000001,Vente,,,,LE CHAMP DE PONT,B092,36800,36106,Luzeret,36,,,361060000C0155,,,,,,,,,,,,,0,,,,,T,terres,,,1820,1.338219,46.535508
2019-553739,2019-11-28,000001,Vente,,,,LE CHAMP DE PONT,B092,36800,36106,Luzeret,36,,,361060000C0156,,,,,,,,,,,,,0,,,,,T,terres,,,1065,1.338893,46.535621
2019-553739,2019-11-28,000001,Vente,,,,LA PETITE PIECE,B263,36800,36106,Luzeret,36,,,361060000C0164,,,,,,,,,,,,,0,,,,,T,terres,,,5085,1.339002,46.537667
2019-553739,2019-11-28,000001,Vente,,,,CHAMP DE LA VIGNE,B087,36800,36106,Luzeret,36,,,361060000C0179,,,,,,,,,,,,,0,,,,,VI,vignes,,,2250,1.336334,46.539043
2019-553739,2019-11-28,000001,Vente,,,,CHAMP DE LA VIGNE,B087,36800,36106,Luzeret,36,,,361060000C0180,,,,,,,,,,,,,0,,,,,T,terres,,,940,1.336106,46.538859
2019-553739,2019-11-28,000001,Vente,,,,LES PIECES,B269,36800,36106,Luzeret,36,,,361060000C0254,,,,,,,,,,,,,0,,,,,T,terres,,,3230,1.334147,46.540711
2019-553739,2019-11-28,000001,Vente,,,,LE GORGEROT,B204,36800,36106,Luzeret,36,,,361060000C0376,,,,,,,,,,,,,0,,,,,T,terres,,,15760,1.346967,46.544151
2019-553739,2019-11-28,000001,Vente,,,,LES PLANTES,B272,36800,36106,Luzeret,36,,,361060000C0406,,,,,,,,,,,,,0,,,,,T,terres,,,382,1.34093,46.537744
2019-553739,2019-11-28,000001,Vente,,,,LES PLANTES,B272,36800,36106,Luzeret,36,,,361060000C0408,,,,,,,,,,,,,0,,,,,T,terres,,,4797,1.341054,46.537984
2019-553739,2019-11-28,000002,Vente,,,,LE PERROLY,B261,36800,36106,Luzeret,36,,,361060000C0018,,,,,,,,,,,,,0,,,,,T,terres,,,5570,1.339018,46.539203
2019-553739,2019-11-28,000002,Vente,,,,LE PATURAL DE LA BARRIERE,B249,36800,36106,Luzeret,36,,,361060000C0086,,,,,,,,,,,,,0,,,,,T,terres,,,19000,1.342489,46.540374
2019-553739,2019-11-28,000002,Vente,,,,LES PLANTES,B272,36800,36106,Luzeret,36,,,361060000C0091,,,,,,,,,,,,,0,,,,,T,terres,,,2060,1.341635,46.537734
2019-553739,2019-11-28,000002,Vente,,,,LA PETITE PIECE,B263,36800,36106,Luzeret,36,,,361060000C0163,,,,,,,,,,,,,0,,,,,T,terres,,,4350,1.338761,46.538642
2019-554279,2019-12-28,000001,Vente,72000,,,LA BOUDRE,B027,36800,36106,Luzeret,36,,,361060000G0349,,,,,,,,,,,,,0,,,,,P,prés,,,6630,1.416641,46.54473
2019-554279,2019-12-28,000001,Vente,72000,,,LA BOUDRE,B027,36800,36106,Luzeret,36,,,361060000G0350,,,,,,,,,,,,,0,,,,,J,jardins,,,451,1.416363,46.545076
2019-554279,2019-12-28,000001,Vente,72000,,,LA BOUDRE,B027,36800,36106,Luzeret,36,,,361060000G0351,,,,,,,,,,,,,0,,,,,P,prés,,,4440,1.416196,46.545348
2019-554279,2019-12-28,000001,Vente,72000,5,,IMP DU GUE,0033,36800,36106,Luzeret,36,,,361060000G0352,,,,,,,,,,,,,0,1,Maison,100,3,S,sols,,,1590,1.416785,46.545118
