id_mutation,date_mutation,numero_disposition,nature_mutation,valeur_fonciere,adresse_numero,adresse_suffixe,adresse_nom_voie,adresse_code_voie,code_postal,code_commune,nom_commune,code_departement,ancien_code_commune,ancien_nom_commune,id_parcelle,ancien_id_parcelle,numero_volume,lot1_numero,lot1_surface_carrez,lot2_numero,lot2_surface_carrez,lot3_numero,lot3_surface_carrez,lot4_numero,lot4_surface_carrez,lot5_numero,lot5_surface_carrez,nombre_lots,code_type_local,type_local,surface_reelle_bati,nombre_pieces_principales,code_nature_culture,nature_culture,code_nature_culture_speciale,nature_culture_speciale,surface_terrain,longitude,latitude
2019-549421,2019-02-25,000001,Vente,30000,4,,RUE DES LILAS,0066,36260,36125,Migny,36,,,361250000A0127,,,,,,,,,,,,,0,1,Maison,40,2,S,sols,,,180,2.06744,47.025181
2019-549421,2019-02-25,000001,Vente,30000,2,,RUE DES LILAS,0066,36260,36125,Migny,36,,,361250000A0649,,,,,,,,,,,,,0,,,,,S,sols,,,20,2.067385,47.025075
2019-549421,2019-02-25,000001,Vente,30000,,,LE BOURG,B005,36260,36125,Migny,36,,,361250000A0651,,,,,,,,,,,,,0,,,,,J,jardins,,,656,2.067641,47.025056
2019-549421,2019-02-25,000001,Vente,30000,,,LE BOURG,B005,36260,36125,Migny,36,,,361250000A0653,,,,,,,,,,,,,0,,,,,S,sols,,,1,2.067463,47.025055
2019-550063,2019-04-17,000002,Vente,1154.64,,,LES PRES DE LA GENEVRAIE,B026,36260,36125,Migny,36,,,361250000A0672,,,,,,,,,,,,,0,,,,,T,terres,,,800,2.032435,47.010939
2019-550063,2019-04-17,000002,Vente,1154.64,,,LES PRES DE LA GENEVRAIE,B026,36260,36125,Migny,36,,,361250000A0673,,,,,,,,,,,,,0,,,,,T,terres,,,332,2.032577,47.011984
2019-550117,2019-04-11,000001,Vente,2172,,,LAVAU,B016,36260,36125,Migny,36,,,361250000A0032,,,,,,,,,,,,,0,,,,,BP,peupleraies,,,5430,2.057175,47.034781
2019-550118,2019-04-11,000002,Vente,1924,,,LAVAU,B016,36260,36125,Migny,36,,,361250000A0038,,,,,,,,,,,,,0,,,,,P,prés,,,4810,2.057826,47.034497
2019-550119,2019-04-11,000003,Vente,1632,,,LAVAU,B016,36260,36125,Migny,36,,,361250000A0037,,,,,,,,,,,,,0,,,,,BP,peupleraies,,,4080,2.058616,47.034495
2019-550246,2019-04-27,000001,Vente,2000,,,LES DORMILLONS,B012,36260,36125,Migny,36,,,361250000A0295,,,,,,,,,,,,,0,,,,,P,prés,,,14105,2.033582,47.03876
2019-552014,2019-08-16,000001,Vente,8000,,,LES GRANDES BARBES D OR,B015,36260,36125,Migny,36,,,36125000ZB0028,,,,,,,,,,,,,0,,,,,T,terres,,,12340,2.043966,46.997569
2019-552014,2019-08-16,000001,Vente,8000,,,LES GRANDES BARBES D OR,B015,36260,36125,Migny,36,,,36125000ZB0029,,,,,,,,,,,,,0,,,,,T,terres,,,840,2.044154,46.998025
2019-552014,2019-08-16,000001,Vente,8000,,,LES GRANDES BARBES D OR,B015,36260,36125,Migny,36,,,36125000ZB0030,,,,,,,,,,,,,0,,,,,T,terres,,,2960,2.044107,46.998285
2019-554143,2019-12-26,000001,Vente,186800,8,,RTE DE LA GENEVRAIE,0045,36260,36125,Migny,36,,,361250000A0319,,,,,,,,,,,,,0,1,Maison,190,6,S,sols,,,7009,2.034369,47.011619
2019-554143,2019-12-26,000001,Vente,186800,,,LA GENEVRAIE,B014,36260,36125,Migny,36,,,361250000A0484,,,,,,,,,,,,,0,,,,,T,terres,,,1890,2.033163,47.011714
2019-554143,2019-12-26,000001,Vente,186800,,,LA GENEVRAIE,B014,36260,36125,Migny,36,,,361250000A0494,,,,,,,,,,,,,0,,,,,BS,taillis sous futaie,,,1660,2.033339,47.012092
2019-554143,2019-12-26,000001,Vente,186800,,,LA GENEVRAIE,B014,36260,36125,Migny,36,,,361250000A0497,,,,,,,,,,,,,0,,,,,T,terres,,,3569,2.033477,47.012477
