id_mutation,date_mutation,numero_disposition,nature_mutation,valeur_fonciere,adresse_numero,adresse_suffixe,adresse_nom_voie,adresse_code_voie,code_postal,code_commune,nom_commune,code_departement,ancien_code_commune,ancien_nom_commune,id_parcelle,ancien_id_parcelle,numero_volume,lot1_numero,lot1_surface_carrez,lot2_numero,lot2_surface_carrez,lot3_numero,lot3_surface_carrez,lot4_numero,lot4_surface_carrez,lot5_numero,lot5_surface_carrez,nombre_lots,code_type_local,type_local,surface_reelle_bati,nombre_pieces_principales,code_nature_culture,nature_culture,code_nature_culture_speciale,nature_culture_speciale,surface_terrain,longitude,latitude
2019-549220,2019-02-18,000001,Vente,1,,,LE BOURG,B041,36500,36243,Villegouin,36,,,36243000AB0125,,,,,,,,,,,,,0,,,,,S,sols,,,81,1.37362,46.96399
2019-549220,2019-02-18,000001,Vente,1,,,LE BOURG,B041,36500,36243,Villegouin,36,,,36243000AB0126,,,,,,,,,,,,,0,,,,,S,sols,,,31,1.373546,46.963951
2019-549220,2019-02-18,000001,Vente,1,5057,,LE BOURG,B041,36500,36243,Villegouin,36,,,36243000AB0127,,,,,,,,,,,,,0,4,Local industriel. commercial ou assimilé,72,0,S,sols,,,279,1.373609,46.963864
2019-549220,2019-02-18,000001,Vente,1,5057,,LE BOURG,B041,36500,36243,Villegouin,36,,,36243000AB0127,,,,,,,,,,,,,0,4,Local industriel. commercial ou assimilé,178,0,S,sols,,,279,1.373609,46.963864
2019-549221,2019-02-18,000002,Vente,50000,,,LE BOURG,B041,36500,36243,Villegouin,36,,,36243000AB0125,,,,,,,,,,,,,0,,,,,S,sols,,,81,1.37362,46.96399
2019-549221,2019-02-18,000002,Vente,50000,,,LE BOURG,B041,36500,36243,Villegouin,36,,,36243000AB0126,,,,,,,,,,,,,0,,,,,S,sols,,,31,1.373546,46.963951
2019-549221,2019-02-18,000002,Vente,50000,5057,,LE BOURG,B041,36500,36243,Villegouin,36,,,36243000AB0127,,,,,,,,,,,,,0,4,Local industriel. commercial ou assimilé,72,0,S,sols,,,279,1.373609,46.963864
2019-549221,2019-02-18,000002,Vente,50000,5057,,LE BOURG,B041,36500,36243,Villegouin,36,,,36243000AB0127,,,,,,,,,,,,,0,4,Local industriel. commercial ou assimilé,178,0,S,sols,,,279,1.373609,46.963864
2019-549757,2019-03-19,000001,Vente,544,,,VAUVERT,B371,36500,36243,Villegouin,36,,,362430000A0384,,,,,,,,,,,,,0,,,,,VI,vignes,,,1360,1.334395,46.983773
2019-549800,2019-04-03,000001,Vente,1585.85,,,AUBUEES DE LA BACTIERE,B003,36500,36243,Villegouin,36,,,362430000B0121,,,,,,,,,,,,,0,,,,,BT,taillis simples,,,1993,1.353959,46.984372
2019-549800,2019-04-03,000001,Vente,1585.85,,,LES SOUCHES,B352,36500,36243,Villegouin,36,,,362430000B0198,,,,,,,,,,,,,0,,,,,BT,taillis simples,,,2538,1.354523,46.986012
2019-550168,2019-04-12,000001,Vente,140000,,,LA MESSINIERE,B218,36500,36243,Villegouin,36,,,362430000E0316,,,,,,,,,,,,,0,,,,,P,prés,,,8615,1.365181,46.962941
2019-550168,2019-04-12,000001,Vente,140000,,,LA MESSINIERE,B218,36500,36243,Villegouin,36,,,362430000E0316,,,,,,,,,,,,,0,,,,,S,sols,,,1115,1.365181,46.962941
2019-550168,2019-04-12,000001,Vente,140000,5121,,LA MESSINIERE,B218,36500,36243,Villegouin,36,,,362430000E0328,,,,,,,,,,,,,0,1,Maison,92,3,S,sols,,,766,1.365769,46.962858
2019-550406,2019-04-27,000001,Vente,47000,,,LES RENFERMES,B342,36500,36243,Villegouin,36,,,362430000A0282,,,,,,,,,,,,,0,,,,,BT,taillis simples,,,3621,1.341505,46.991279
2019-550406,2019-04-27,000001,Vente,47000,,,LE BOURG,B041,36500,36243,Villegouin,36,,,36243000AB0081,,,,,,,,,,,,,0,,,,,J,jardins,,,1278,1.371575,46.964679
2019-550406,2019-04-27,000001,Vente,47000,,,LE BOURG,B041,36500,36243,Villegouin,36,,,36243000AB0091,,,,,,,,,,,,,0,,,,,J,jardins,,,2330,1.371585,46.964903
2019-550406,2019-04-27,000001,Vente,47000,,,CHAMPS DE VILLEGOUIN,B085,36500,36243,Villegouin,36,,,362430000D0136,,,,,,,,,,,,,0,,,,,T,terres,,,4340,1.369388,46.965516
2019-550406,2019-04-27,000001,Vente,47000,,,CHAMPS DE VILLEGOUIN,B085,36500,36243,Villegouin,36,,,362430000D0137,,,,,,,,,,,,,0,,,,,T,terres,,,4800,1.370389,46.965105
2019-550406,2019-04-27,000001,Vente,47000,,,CHAMPS DE VILLEGOUIN,B085,36500,36243,Villegouin,36,,,362430000D0138,,,,,,,,,,,,,0,,,,,T,terres,,,7829,1.368946,46.9646
2019-550406,2019-04-27,000001,Vente,47000,,,CHAMPS DE VILLEGOUIN,B085,36500,36243,Villegouin,36,,,362430000D0139,,,,,,,,,,,,,0,,,,,T,terres,,,1170,1.36942,46.964986
2019-550406,2019-04-27,000001,Vente,47000,,,CHAMPS DE VILLEGOUIN,B085,36500,36243,Villegouin,36,,,362430000D0140,,,,,,,,,,,,,0,,,,,T,terres,,,6517,1.368752,46.964964
2019-550406,2019-04-27,000001,Vente,47000,,,LA PROVINCE,B334,36500,36243,Villegouin,36,,,362430000D0145,,,,,,,,,,,,,0,,,,,T,terres,,,8210,1.366792,46.965261
2019-550406,2019-04-27,000001,Vente,47000,,,LA PROVINCE,B334,36500,36243,Villegouin,36,,,362430000D0146,,,,,,,,,,,,,0,,,,,T,terres,,,2480,1.366673,46.964622
2019-550406,2019-04-27,000001,Vente,47000,,,LA PROVINCE,B334,36500,36243,Villegouin,36,,,362430000D0147,,,,,,,,,,,,,0,,,,,T,terres,,,7290,1.367178,46.964214
2019-550406,2019-04-27,000001,Vente,47000,,,LES BERNIAIRIES,B018,36500,36243,Villegouin,36,,,362430000D0171,,,,,,,,,,,,,0,,,,,T,terres,,,1208,1.366765,46.966813
2019-550406,2019-04-27,000001,Vente,47000,,,LES BERNIAIRIES,B018,36500,36243,Villegouin,36,,,362430000D0172,,,,,,,,,,,,,0,,,,,T,terres,,,2362,1.367151,46.966995
2019-550406,2019-04-27,000001,Vente,47000,,,LES BERNIAIRIES,B018,36500,36243,Villegouin,36,,,362430000D0173,,,,,,,,,,,,,0,,,,,T,terres,,,3810,1.366843,46.967159
2019-550406,2019-04-27,000001,Vente,47000,,,LA BERTAUDRIE,B019,36500,36243,Villegouin,36,,,362430000E0334,,,,,,,,,,,,,0,,,,,T,terres,,,13578,1.367972,46.962876
2019-550406,2019-04-27,000001,Vente,47000,,,LES COUDES,B117,36500,36243,Villegouin,36,,,362430000E0335,,,,,,,,,,,,,0,,,,,T,terres,,,6935,1.368318,46.961911
2019-550406,2019-04-27,000001,Vente,47000,,,LES COUDES,B117,36500,36243,Villegouin,36,,,362430000E0340,,,,,,,,,,,,,0,,,,,T,terres,,,1528,1.368506,46.961519
2019-550406,2019-04-27,000001,Vente,47000,,,CHAMPS DE VILLEGOUIN,B085,36500,36243,Villegouin,36,,,362430000E0744,,,,,,,,,,,,,0,,,,,T,terres,,,1971,1.369182,46.963146
2019-550406,2019-04-27,000001,Vente,47000,,,CHAMPS DE VILLEGOUIN,B085,36500,36243,Villegouin,36,,,362430000E0746,,,,,,,,,,,,,0,,,,,T,terres,,,3548,1.36909,46.963535
2019-550406,2019-04-27,000001,Vente,47000,,,CHAMPS DE VILLEGOUIN,B085,36500,36243,Villegouin,36,,,362430000E0749,,,,,,,,,,,,,0,,,,,T,terres,,,1957,1.369847,46.96405
2019-550406,2019-04-27,000001,Vente,47000,,,CHAMPS DE VILLEGOUIN,B085,36500,36243,Villegouin,36,,,362430000E0750,,,,,,,,,,,,,0,,,,,T,terres,,,7633,1.370071,46.964129
2019-550406,2019-04-27,000001,Vente,47000,,,CHAMPS DE VILLEGOUIN,B085,36500,36243,Villegouin,36,,,362430000E0751,,,,,,,,,,,,,0,,,,,T,terres,,,6320,1.371305,46.964121
2019-550409,2019-04-27,000001,Vente,50000,,,LA BERTAUDRIE,B019,36500,36243,Villegouin,36,,,362430000E0331,,,,,,,,,,,,,0,,,,,P,prés,,,2125,1.367226,46.963746
2019-550409,2019-04-27,000001,Vente,50000,,,LA BERTAUDRIE,B019,36500,36243,Villegouin,36,,,362430000E0332,,,,,,,,,,,,,0,,,,,S,sols,,,10,1.367708,46.963817
2019-550409,2019-04-27,000001,Vente,50000,,,LA BERTAUDRIE,B019,36500,36243,Villegouin,36,,,362430000E0332,,,,,,,,,,,,,0,,,,,J,jardins,,,976,1.367708,46.963817
2019-550409,2019-04-27,000001,Vente,50000,5122,,LA BERTAUDRIE,B019,36500,36243,Villegouin,36,,,362430000E0333,,,,,,,,,,,,,0,1,Maison,78,3,S,sols,,,781,1.367856,46.963674
2019-550409,2019-04-27,000001,Vente,50000,,,CHAMPS DE VILLEGOUIN,B085,36500,36243,Villegouin,36,,,362430000E0747,,,,,,,,,,,,,0,,,,,S,sols,,,209,1.368102,46.963849
2019-550409,2019-04-27,000001,Vente,50000,,,CHAMPS DE VILLEGOUIN,B085,36500,36243,Villegouin,36,,,362430000E0748,,,,,,,,,,,,,0,,,,,T,terres,,,7339,1.368583,46.963855
2019-550409,2019-04-27,000001,Vente,50000,,,CHAMPS DE VILLEGOUIN,B085,36500,36243,Villegouin,36,,,362430000E0748,,,,,,,,,,,,,0,,,,,S,sols,,,811,1.368583,46.963855
2019-551161,2019-06-26,000001,Vente,52000,3,,RUE DES AC. D AFN,0010,36500,36243,Villegouin,36,,,362430000E0929,,,,,,,,,,,,,0,1,Maison,66,3,S,sols,,,566,1.373948,46.965456
2019-551452,2019-07-10,000001,Vente,200,,,CHAMPS DE VILLEGOUIN,B085,36500,36243,Villegouin,36,,,362430000E0738,,,,,,,,,,,,,0,,,,,T,terres,,,340,1.370587,46.962463
2019-551936,2019-08-01,000001,Vente,109300,,,LE PUE,B335,36500,36243,Villegouin,36,,,362430000B0603,,,,,,,,,,,,,0,,,,,P,prés,,,1317,1.342114,46.983355
2019-551936,2019-08-01,000001,Vente,109300,,,LE PUE,B335,36500,36243,Villegouin,36,,,362430000B0605,,,,,,,,,,,,,0,,,,,S,sols,,,118,1.341549,46.983455
2019-551936,2019-08-01,000001,Vente,109300,2,,LE PUE,B335,36500,36243,Villegouin,36,,,362430000B0607,,,,,,,,,,,,,0,1,Maison,93,3,S,sols,,,101,1.341496,46.983278
2019-551936,2019-08-01,000001,Vente,109300,,,LE PUE,B335,36500,36243,Villegouin,36,,,362430000B0608,,,,,,,,,,,,,0,,,,,S,sols,,,814,1.341745,46.98332
2019-551936,2019-08-01,000001,Vente,109300,,,LE PUE,B335,36500,36243,Villegouin,36,,,362430000B0609,,,,,,,,,,,,,0,,,,,P,prés,,,35,1.341651,46.983065
2019-551936,2019-08-01,000001,Vente,109300,,,LE PUE,B335,36500,36243,Villegouin,36,,,362430000B0610,,,,,,,,,,,,,0,,,,,P,prés,,,2992,1.342081,46.982938
2019-551936,2019-08-01,000001,Vente,109300,,,LE PUE,B335,36500,36243,Villegouin,36,,,362430000B0611,,,,,,,,,,,,,0,,,,,P,prés,,,1406,1.342572,46.983063
2019-552145,2019-08-26,000001,Vente,59782.65,,,LE MOURIER,B230,36500,36243,Villegouin,36,,,362430000C0419,,,,,,,,,,,,,0,,,,,T,terres,,,2593,1.337164,46.965594
2019-552145,2019-08-26,000001,Vente,59782.65,,,LE MOURIER,B230,36500,36243,Villegouin,36,,,362430000C0420,,,,,,,,,,,,,0,,,,,J,jardins,,,520,1.337143,46.965798
2019-552145,2019-08-26,000001,Vente,59782.65,5162,,LE MOURIER,B230,36500,36243,Villegouin,36,,,362430000C0421,,,,,,,,,,,,,0,1,Maison,65,3,S,sols,,,949,1.337686,46.965809
2019-552145,2019-08-26,000001,Vente,59782.65,,,LE MOURIER,B230,36500,36243,Villegouin,36,,,362430000C0426,,,,,,,,,,,,,0,,,,,T,terres,,,2333,1.336128,46.965586
2019-552145,2019-08-26,000001,Vente,59782.65,,,LE MOURIER,B230,36500,36243,Villegouin,36,,,362430000C0561,,,,,,,,,,,,,0,,,,,T,terres,,,3480,1.337232,46.965921
2019-553119,2019-10-22,000001,Vente,30000,4,,RUE DU HUIT MAI 1945,0030,36500,36243,Villegouin,36,,,36243000AB0148,,,,,,,,,,,,,0,4,Local industriel. commercial ou assimilé,197,0,S,sols,,,819,1.373162,46.96524
2019-554108,2019-12-20,000001,Vente,10000,5019,,LE BOURG,B041,36500,36243,Villegouin,36,,,36243000AB0099,,,,,,,,,,,,,0,1,Maison,54,3,S,sols,,,220,1.372804,46.964911
2019-554108,2019-12-20,000001,Vente,10000,,,LE BOURG,B041,36500,36243,Villegouin,36,,,36243000AB0111,,,,,,,,,,,,,0,,,,,J,jardins,,,629,1.372073,46.96478
2019-554270,2019-12-28,000001,Vente,145000,,,CEREZ,B069,36500,36243,Villegouin,36,,,362430000F0464,,,,,,,,,,,,,0,,,,,T,terres,,,2462,1.372128,46.952816
2019-554270,2019-12-28,000001,Vente,145000,8,,CEREZ,B069,36500,36243,Villegouin,36,,,362430000F0465,,,,,,,,,,,,,0,1,Maison,197,6,S,sols,,,1011,1.371947,46.953075
2019-554270,2019-12-28,000001,Vente,145000,,,CEREZ,B069,36500,36243,Villegouin,36,,,362430000F0823,,,,,,,,,,,,,0,,,,,T,terres,,,1026,1.371661,46.95301
