id_mutation,date_mutation,numero_disposition,nature_mutation,valeur_fonciere,adresse_numero,adresse_suffixe,adresse_nom_voie,adresse_code_voie,code_postal,code_commune,nom_commune,code_departement,ancien_code_commune,ancien_nom_commune,id_parcelle,ancien_id_parcelle,numero_volume,lot1_numero,lot1_surface_carrez,lot2_numero,lot2_surface_carrez,lot3_numero,lot3_surface_carrez,lot4_numero,lot4_surface_carrez,lot5_numero,lot5_surface_carrez,nombre_lots,code_type_local,type_local,surface_reelle_bati,nombre_pieces_principales,code_nature_culture,nature_culture,code_nature_culture_speciale,nature_culture_speciale,surface_terrain,longitude,latitude
2019-569358,2019-03-04,000001,Vente,72000,,,LES FOURS A CHAUX,B032,37350,37181,Paulmy,37,,,37181000ZT0047,,,,,,,,,,,,,0,,,,,T,terres,,,21020,0.802605,46.973184
2019-569359,2019-03-04,000001,Vente,34524,,,LES FOURS A CHAUX,B032,37350,37181,Paulmy,37,,,37181000ZT0051,,,,,,,,,,,,,0,,,,,VI,vignes,,,2820,0.802875,46.972286
2019-569556,2019-04-23,000001,Vente,2000,,,LES GRANDES MAISONS,B041,37350,37181,Paulmy,37,,,37181000ZO0069,,,,,,,,,,,,,0,,,,,VI,vignes,,,2610,0.837344,46.958556
2019-569556,2019-04-23,000001,Vente,2000,,,LES GRANDES MAISONS,B041,37350,37181,Paulmy,37,,,37181000ZO0070,,,,,,,,,,,,,0,,,,,VI,vignes,,,2632,0.836918,46.958715
2019-569587,2019-05-02,000001,Vente,25000,8,,IMP DU LAVOIR,0025,37350,37181,Paulmy,37,,,371810000A0377,,,,,,,,,,,,,0,3,Dépendance,,0,S,sols,,,569,0.838368,46.980947
2019-569587,2019-05-02,000001,Vente,25000,,,LE BOURG,B008,37350,37181,Paulmy,37,,,371810000A1272,,,,,,,,,,,,,0,,,,,S,sols,,,1,0.838208,46.981378
2019-569587,2019-05-02,000001,Vente,25000,2,,IMP DU LAVOIR,0025,37350,37181,Paulmy,37,,,371810000A1274,,,,,,,,,,,,,0,1,Maison,70,4,S,sols,,,157,0.838203,46.981366
2019-569609,2019-05-17,000001,Vente,250,,,GARENNE DE LA VERNOISIERE,B034,37350,37181,Paulmy,37,,,37181000ZR0048,,,,,,,,,,,,,0,,,,,S,sols,,,1790,0.817296,46.954073
2019-569805,2019-06-11,000001,Vente,90000,3,,RUE DE LA FORGE,0020,37350,37181,Paulmy,37,,,371810000A1050,,,,,,,,,,,,,0,4,Local industriel. commercial ou assimilé,187,0,S,sols,,,401,0.838327,46.98264
2019-569805,2019-06-11,000001,Vente,90000,5,,RUE DE LA FORGE,0020,37350,37181,Paulmy,37,,,371810000A1063,,,,,,,,,,,,,0,1,Maison,95,4,S,sols,,,228,0.838364,46.982756
2019-569805,2019-06-11,000001,Vente,90000,,,CHATEAU DE PAULMY,B014,37350,37181,Paulmy,37,,,371810000A1275,,,,,,,,,,,,,0,,,,,T,terres,,,264,0.838191,46.982676
2019-569805,2019-06-11,000001,Vente,90000,,,CHATEAU DE PAULMY,B014,37350,37181,Paulmy,37,,,371810000A1275,,,,,,,,,,,,,0,,,,,S,sols,,,25,0.838191,46.982676
2019-569838,2019-07-08,000001,Vente,80000,,,LA GARENNE DE PAUVRELAY,B035,37350,37181,Paulmy,37,,,37181000ZK0010,,,,,,,,,,,,,0,,,,,J,jardins,POTAG,Jardin potager,1270,0.817832,46.996069
2019-569838,2019-07-08,000001,Vente,80000,,,LA GARENNE DE PAUVRELAY,B035,37350,37181,Paulmy,37,,,37181000ZK0024,,,,,,,,,,,,,0,,,,,T,terres,,,1840,0.817712,46.995801
2019-569838,2019-07-08,000001,Vente,80000,103,,LA GARENNE DE PAUVRELAY,B035,37350,37181,Paulmy,37,,,37181000ZK0025,,,,,,,,,,,,,0,1,Maison,91,4,S,sols,,,550,0.81791,46.99569
2019-570141,2019-09-06,000001,Vente,2500,,,LA TAILLE,B093,37350,37181,Paulmy,37,,,37181000ZB0013,,,,,,,,,,,,,0,,,,,T,terres,,,3019,0.842124,46.987358
2019-570141,2019-09-06,000001,Vente,2500,,,LA TAILLE,B093,37350,37181,Paulmy,37,,,37181000ZB0013,,,,,,,,,,,,,0,,,,,VI,vignes,,,551,0.842124,46.987358
2019-570203,2019-10-16,000001,Vente,,180,A,LA ROUZIE,B087,37350,37181,Paulmy,37,,,37181000ZO0081,,,,,,,,,,,,,0,4,Local industriel. commercial ou assimilé,,,S,sols,,,695,,
2019-570203,2019-10-16,000002,Vente,,180,A,LA ROUZIE,B087,37350,37181,Paulmy,37,,,37181000ZO0081,,,,,,,,,,,,,0,4,Local industriel. commercial ou assimilé,,,S,sols,,,695,,
2019-570203,2019-10-16,000003,Vente,,180,A,LA ROUZIE,B087,37350,37181,Paulmy,37,,,37181000ZO0081,,,,,,,,,,,,,0,4,Local industriel. commercial ou assimilé,,,S,sols,,,695,,
2019-570204,2019-10-14,000001,Vente,65000,,,LE BOURG,B008,37350,37181,Paulmy,37,,,371810000A1277,,,,,,,,,,,,,0,,,,,S,sols,,,10,0.840306,46.982905
2019-570204,2019-10-14,000001,Vente,65000,,,LE BOURG,B008,37350,37181,Paulmy,37,,,371810000A1277,,,,,,,,,,,,,0,,,,,T,terres,,,1099,0.840306,46.982905
2019-570204,2019-10-14,000001,Vente,65000,7,,RUE DU STADE,0045,37350,37181,Paulmy,37,,,371810000A1279,,,,,,,,,,,,,0,1,Maison,180,6,S,sols,,,568,0.840334,46.982533
2019-570213,2019-10-02,000001,Vente,5000,,,LA ROYAUTE,B088,37350,37181,Paulmy,37,,,37181000ZB0161,,,,,,,,,,,,,0,,,,,S,sols,,,20,0.840509,46.991057
2019-570213,2019-10-02,000001,Vente,5000,,,LA ROYAUTE,B088,37350,37181,Paulmy,37,,,37181000ZB0163,,,,,,,,,,,,,0,,,,,J,jardins,POTAG,Jardin potager,412,0.840461,46.991132
2019-570322,2019-10-25,000001,Vente,138000,28,A,CHATEAU DE PAULMY,B014,37350,37181,Paulmy,37,,,371810000A1184,,,,,,,,,,,,,0,1,Maison,163,6,S,sols,,,167,0.832259,46.981816
2019-570322,2019-10-25,000001,Vente,138000,,,CHATEAU DE PAULMY,B014,37350,37181,Paulmy,37,,,371810000A1372,,,,,,,,,,,,,0,,,,,T,terres,,,3835,0.832158,46.981568
2019-570322,2019-10-25,000001,Vente,138000,,,CHATEAU DE PAULMY,B014,37350,37181,Paulmy,37,,,371810000A1375,,,,,,,,,,,,,0,,,,,T,terres,,,526,0.832521,46.981381
2019-570414,2019-11-28,000001,Vente,510000,,,LA TAILLE,B093,37350,37181,Paulmy,37,,,371810000A0223,,,,,,,,,,,,,0,,,,,BT,taillis simples,,,270,0.83893,46.983863
2019-570414,2019-11-28,000001,Vente,510000,,,LE PARC DE PAULMY,B068,37350,37181,Paulmy,37,,,371810000A0246,,,,,,,,,,,,,0,,,,,T,terres,,,29960,0.837757,46.989122
2019-570414,2019-11-28,000001,Vente,510000,,,LE PARC DE PAULMY,B068,37350,37181,Paulmy,37,,,371810000A0247,,,,,,,,,,,,,0,,,,,T,terres,,,6700,0.839418,46.988562
2019-570414,2019-11-28,000001,Vente,510000,,,CHATEAU DE PAULMY,B014,37350,37181,Paulmy,37,,,371810000A0523,,,,,,,,,,,,,0,,,,,T,terres,,,315,0.834319,46.98098
2019-570414,2019-11-28,000001,Vente,510000,,,CHATEAU DE PAULMY,B014,37350,37181,Paulmy,37,,,371810000A0525,,,,,,,,,,,,,0,,,,,T,terres,,,59840,0.830432,46.980795
2019-570414,2019-11-28,000001,Vente,510000,,,CHATEAU DE PAULMY,B014,37350,37181,Paulmy,37,,,371810000A0526,,,,,,,,,,,,,0,,,,,BT,taillis simples,,,2160,0.827241,46.981985
2019-570414,2019-11-28,000001,Vente,510000,,,CHATEAU DE PAULMY,B014,37350,37181,Paulmy,37,,,371810000A0527,,,,,,,,,,,,,0,,,,,T,terres,,,12640,0.827191,46.981488
2019-570414,2019-11-28,000001,Vente,510000,,,LES GRANDS PRES,B043,37350,37181,Paulmy,37,,,371810000A0529,,,,,,,,,,,,,0,,,,,T,terres,,,51155,0.829764,46.98003
2019-570414,2019-11-28,000001,Vente,510000,,,CHATEAU DE PAULMY,B014,37350,37181,Paulmy,37,,,371810000A1276,,,,,,,,,,,,,0,,,,,T,terres,,,78313,,
2019-570414,2019-11-28,000001,Vente,510000,,,CHATEAU DE PAULMY,B014,37350,37181,Paulmy,37,,,371810000A1329,,,,,,,,,,,,,0,,,,,T,terres,,,33,0.835081,46.981611
2019-570414,2019-11-28,000001,Vente,510000,,,CHATEAU DE PAULMY,B014,37350,37181,Paulmy,37,,,371810000A1332,,,,,,,,,,,,,0,,,,,T,terres,,,6611,0.835478,46.982149
