id_mutation,date_mutation,numero_disposition,nature_mutation,valeur_fonciere,adresse_numero,adresse_suffixe,adresse_nom_voie,adresse_code_voie,code_postal,code_commune,nom_commune,code_departement,ancien_code_commune,ancien_nom_commune,id_parcelle,ancien_id_parcelle,numero_volume,lot1_numero,lot1_surface_carrez,lot2_numero,lot2_surface_carrez,lot3_numero,lot3_surface_carrez,lot4_numero,lot4_surface_carrez,lot5_numero,lot5_surface_carrez,nombre_lots,code_type_local,type_local,surface_reelle_bati,nombre_pieces_principales,code_nature_culture,nature_culture,code_nature_culture_speciale,nature_culture_speciale,surface_terrain,longitude,latitude
2019-570817,2019-01-22,000001,Vente,344300,5188,,RUE DE LA SOURCE,0260,38320,38057,Bresson,38,,,38057000AD0017,,,1,,,,,,,,,,1,1,Maison,99,5,S,sols,,,127,5.748511,45.135631
2019-570817,2019-01-22,000001,Vente,344300,,,LA MONTAGNE,B012,38320,38057,Bresson,38,,,38057000AD0125,,,,,,,,,,,,,0,,,,,S,sols,,,135,5.748283,45.135529
2019-571086,2019-02-14,000001,Vente,2,5,,RUE DES CONDAMINES,0029,38320,38057,Bresson,38,,,38057000AB0019,,,,,,,,,,,,,0,4,Local industriel. commercial ou assimilé,,,S,sols,,,16922,5.737969,45.140929
2019-571086,2019-02-14,000001,Vente,2,5,,RUE DES CONDAMINES,0029,38320,38057,Bresson,38,,,38057000AB0019,,,,,,,,,,,,,0,4,Local industriel. commercial ou assimilé,1050,0,S,sols,,,16922,5.737969,45.140929
2019-571086,2019-02-14,000001,Vente,2,5,,RUE DES CONDAMINES,0029,38320,38057,Bresson,38,,,38057000AB0019,,,,,,,,,,,,,0,4,Local industriel. commercial ou assimilé,,0,S,sols,,,16922,5.737969,45.140929
2019-571541,2019-03-07,000001,Vente,600000,27,,RUE DE LA REPUBLIQUE,0240,38320,38057,Bresson,38,,,38057000AB0065,,,,,,,,,,,,,0,1,Maison,191,9,S,sols,,,1070,5.741198,45.140933
2019-571541,2019-03-07,000001,Vente,600000,,,PANATIERE,B014,38320,38057,Bresson,38,,,38057000AB0067,,,,,,,,,,,,,0,,,,,S,sols,,,65,5.741273,45.140932
2019-571600,2019-03-18,000001,Vente,200800,3,,PL DES TILLEULS,0271,38320,38057,Bresson,38,,,38057000AC0225,,,11,,28,,,,,,,,2,2,Appartement,63,3,,,,,,5.748015,45.137996
2019-572597,2019-05-21,000001,Vente,415000,7,,ALL DES GRANDS CHAMPS,0064,38320,38057,Bresson,38,,,38057000AC0137,,,,,,,,,,,,,0,1,Maison,98,5,S,sols,,,702,5.743446,45.137397
2019-573235,2019-06-19,000001,Vente,225000,,,GR GRANDE RUE,0060,38320,38057,Bresson,38,,,38057000AD0168,,,,,,,,,,,,,0,,,,,S,sols,,,549,5.748323,45.136247
2019-573235,2019-06-19,000001,Vente,225000,,,GR GRANDE RUE,0060,38320,38057,Bresson,38,,,38057000AD0171,,,,,,,,,,,,,0,,,,,AB,terrains a bâtir,,,500,5.748418,45.136122
2019-573345,2019-07-02,000001,Vente,465000,10,,LOT CLOS DU CHATEAU,A002,38320,38057,Bresson,38,,,38057000AC0088,,,,,,,,,,,,,0,1,Maison,118,7,S,sols,,,771,5.747,45.138032
2019-573389,2019-06-28,000001,Vente,480000,5158,,RUE DE L ORATOIRE,0220,38320,38057,Bresson,38,,,38057000AC0298,,,,,,,,,,,,,0,1,Maison,177,4,S,sols,,,708,5.741807,45.139477
2019-573389,2019-06-28,000001,Vente,480000,,,BERNARDIERE,B001,38320,38057,Bresson,38,,,38057000AC0301,,,,,,,,,,,,,0,,,,,S,sols,,,58,5.741485,45.139615
2019-573389,2019-06-28,000001,Vente,480000,10,B,RUE DE L ORATOIRE,0220,38320,38057,Bresson,38,,,38057000AC0319,,,,,,,,,,,,,0,,,,,S,sols,,,142,5.741773,45.139409
2019-573597,2019-07-05,000001,Vente,1000,,,LES CHATAIGNERES,B004,38320,38057,Bresson,38,,,380570000A0856,,,,,,,,,,,,,0,,,,,BS,taillis sous futaie,,,3163,5.750838,45.128544
2019-573597,2019-07-05,000001,Vente,1000,,,MONTAVIE,B013,38320,38057,Bresson,38,,,380570000B0177,,,,,,,,,,,,,0,,,,,AG,terrains d'agrément,,,1983,5.756419,45.127054
2019-573597,2019-07-05,000002,Vente,1000,,,MONTAVIE,B013,38320,38057,Bresson,38,,,380570000B0184,,,,,,,,,,,,,0,,,,,S,sols,,,219,5.756167,45.128096
2019-573597,2019-07-05,000002,Vente,1000,,,MONTAVIE,B013,38320,38057,Bresson,38,,,380570000B0186,,,,,,,,,,,,,0,,,,,S,sols,,,314,5.756836,45.128104
2019-573597,2019-07-05,000002,Vente,1000,,,MONTAVIE,B013,38320,38057,Bresson,38,,,380570000B0188,,,,,,,,,,,,,0,,,,,S,sols,,,77,5.755878,45.127824
2019-573597,2019-07-05,000002,Vente,1000,,,MONTAVIE,B013,38320,38057,Bresson,38,,,380570000B0190,,,,,,,,,,,,,0,,,,,S,sols,,,594,5.755105,45.127356
2019-573601,2019-07-05,000002,Vente,100,,,MONTAVIE,B013,38320,38057,Bresson,38,,,380570000B0178,,,,,,,,,,,,,0,,,,,T,terres,,,8,5.756413,45.128276
2019-573607,2019-06-28,000001,Vente,205000,,,GR GRANDE RUE,0060,38320,38057,Bresson,38,,,38057000AD0168,,,,,,,,,,,,,0,,,,,S,sols,,,549,5.748323,45.136247
2019-573607,2019-06-28,000001,Vente,205000,3,B,GR GRANDE RUE,0060,38320,38057,Bresson,38,,,38057000AD0170,,,,,,,,,,,,,0,1,Maison,125,4,S,sols,,,444,5.748712,45.136258
2019-573768,2019-07-16,000001,Vente,270000,,,GR GRANDE RUE,0060,38320,38057,Bresson,38,,,38057000AD0163,,,,,,,,,,,,,0,,,,,AB,terrains a bâtir,,,416,5.748028,45.136623
2019-573768,2019-07-16,000001,Vente,270000,5,,GR GRANDE RUE,0060,38320,38057,Bresson,38,,,38057000AD0164,,,,,,,,,,,,,0,1,Maison,158,6,S,sols,,,405,5.747757,45.136572
2019-573768,2019-07-16,000001,Vente,270000,,,GR GRANDE RUE,0060,38320,38057,Bresson,38,,,38057000AD0165,,,,,,,,,,,,,0,,,,,AB,terrains a bâtir,,,552,5.747457,45.136529
2019-574658,2019-09-05,000001,Vente,270000,3,B,GR GRANDE RUE,0060,38320,38057,Bresson,38,,,38057000AD0163,,,,,,,,,,,,,0,1,Maison,126,5,S,sols,,,416,5.748028,45.136623
2019-574658,2019-09-05,000001,Vente,270000,,,GR GRANDE RUE,0060,38320,38057,Bresson,38,,,38057000AD0166,,,,,,,,,,,,,0,,,,,AB,terrains a bâtir,,,396,5.747787,45.136426
2019-574658,2019-09-05,000001,Vente,270000,,,GR GRANDE RUE,0060,38320,38057,Bresson,38,,,38057000AD0167,,,,,,,,,,,,,0,,,,,AB,terrains a bâtir,,,463,5.747462,45.136344
2019-574816,2019-09-04,000001,Vente,470000,,,BERNARDIERE,B001,38320,38057,Bresson,38,,,38057000AC0296,,,,,,,,,,,,,0,,,,,AB,terrains a bâtir,,,126,5.741911,45.139539
2019-574816,2019-09-04,000001,Vente,470000,10,B,RUE DE L ORATOIRE,0220,38320,38057,Bresson,38,,,38057000AC0318,,,,,,,,,,,,,0,1,Maison,115,5,S,sols,,,533,5.742106,45.139386
2019-574912,2019-09-25,000001,Vente,1,,,BERNARDIERE,B001,38320,38057,Bresson,38,,,38057000AC0349,,,,,,,,,,,,,0,,,,,AB,terrains a bâtir,,,90,5.744011,45.138622
2019-575261,2019-10-02,000001,Vente,235000,,,GR GRANDE RUE,0060,38320,38057,Bresson,38,,,38057000AD0168,,,,,,,,,,,,,0,,,,,S,sols,,,549,5.748323,45.136247
2019-575261,2019-10-02,000001,Vente,235000,,,GR GRANDE RUE,0060,38320,38057,Bresson,38,,,38057000AD0172,,,,,,,,,,,,,0,,,,,AB,terrains a bâtir,,,600,5.748126,45.136083
2019-575510,2019-10-23,000001,Vente,132000,2,,PL DES TILLEULS,0271,38320,38057,Bresson,38,,,38057000AC0198,,,19,,,,,,,,,,1,2,Appartement,75,4,,,,,,5.747486,45.138034
2019-575510,2019-10-23,000001,Vente,132000,2,,PL DES TILLEULS,0271,38320,38057,Bresson,38,,,38057000AC0198,,,29,76,,,,,,,,,1,2,Appartement,75,4,S,sols,,,605,5.747486,45.138034
2019-575565,2019-10-10,000001,Vente,440000,6,,RUE DE L ORATOIRE,0220,38320,38057,Bresson,38,,,38057000AC0175,,,,,,,,,,,,,0,1,Maison,130,5,S,sols,,,1301,5.741615,45.139109
2019-575663,2019-10-28,000001,Vente,507375,4,,PRE BRESSON,B015,38320,38057,Bresson,38,,,38057000AC0019,,,,,,,,,,,,,0,1,Maison,136,6,S,sols,,,814,5.742127,45.141581
