id_mutation,date_mutation,numero_disposition,nature_mutation,valeur_fonciere,adresse_numero,adresse_suffixe,adresse_nom_voie,adresse_code_voie,code_postal,code_commune,nom_commune,code_departement,ancien_code_commune,ancien_nom_commune,id_parcelle,ancien_id_parcelle,numero_volume,lot1_numero,lot1_surface_carrez,lot2_numero,lot2_surface_carrez,lot3_numero,lot3_surface_carrez,lot4_numero,lot4_surface_carrez,lot5_numero,lot5_surface_carrez,nombre_lots,code_type_local,type_local,surface_reelle_bati,nombre_pieces_principales,code_nature_culture,nature_culture,code_nature_culture_speciale,nature_culture_speciale,surface_terrain,longitude,latitude
2019-588101,2019-01-03,000001,Vente,86000,,,PERLLEY,B043,38110,38064,Cessieu,38,,,38064000AD0439,,,,,,,,,,,,,0,,,,,AB,terrains a bâtir,,,776,5.370181,45.56486
2019-588110,2019-01-04,000001,Vente terrain à bâtir,115000,,,PERLLEY,B043,38110,38064,Cessieu,38,,,38064000AD0103,,,,,,,,,,,,,0,,,,,AB,terrains a bâtir,,,152,5.373066,45.564391
2019-588110,2019-01-04,000001,Vente terrain à bâtir,115000,,,PERLLEY,B043,38110,38064,Cessieu,38,,,38064000AD0419,,,,,,,,,,,,,0,,,,,AB,terrains a bâtir,,,658,5.373216,45.564272
2019-588110,2019-01-04,000001,Vente terrain à bâtir,115000,23,,RUE DE LA FABRIQUE,0440,38110,38064,Cessieu,38,,,38064000AD0434,,,,,,,,,,,,,0,,,,,S,sols,,,130,5.372839,45.564468
2019-588110,2019-01-04,000001,Vente terrain à bâtir,115000,23,,RUE DE LA FABRIQUE,0440,38110,38064,Cessieu,38,,,38064000AD0435,,,,,,,,,,,,,0,,,,,S,sols,,,14,5.372712,45.564447
2019-588110,2019-01-04,000001,Vente terrain à bâtir,115000,23,,RUE DE LA FABRIQUE,0440,38110,38064,Cessieu,38,,,38064000AD0436,,,,,,,,,,,,,0,,,,,S,sols,,,41,5.372654,45.564403
2019-588133,2019-01-11,000002,Vente,142000,,,QUARTIER DU REVOL,B059,38110,38064,Cessieu,38,,,38064000AE0267,,,,,,,,,,,,,0,,,,,J,jardins,,,67,5.374954,45.565297
2019-588133,2019-01-11,000002,Vente,142000,26,,RUE DU REVOL,0940,38110,38064,Cessieu,38,,,38064000AE0496,,,,,,,,,,,,,0,1,Maison,65,3,S,sols,,,188,5.375056,45.565362
2019-588173,2019-01-11,000001,Vente,120000,4,,RTE DE CHAMBERY,0175,38110,38064,Cessieu,38,,,38064000AE0154,,,5,,,,,,,,,,1,3,Dépendance,,0,,,,,,5.375802,45.566965
2019-588173,2019-01-11,000001,Vente,120000,4,,RTE DE CHAMBERY,0175,38110,38064,Cessieu,38,,,38064000AE0154,,,1,64.21,,,,,,,,,1,4,Local industriel. commercial ou assimilé,68,0,,,,,,5.375802,45.566965
2019-588197,2019-01-07,000001,Vente,80000,,,PERLLEY,B043,38110,38064,Cessieu,38,,,38064000AD0442,,,,,,,,,,,,,0,,,,,AB,terrains a bâtir,,,720,5.370106,45.564167
2019-588223,2019-01-17,000001,Vente,95000,6,,MTE DES BALMETTES,0050,38110,38064,Cessieu,38,,,38064000AE0079,,,4,,,,,,,,,,1,2,Appartement,60,3,,,,,,5.377707,45.568121
2019-588223,2019-01-17,000001,Vente,95000,6,,MTE DES BALMETTES,0050,38110,38064,Cessieu,38,,,38064000AE0079,,,25,,,,,,,,,,1,3,Dépendance,,0,,,,,,5.377707,45.568121
2019-588223,2019-01-17,000001,Vente,95000,6,,MTE DES BALMETTES,0050,38110,38064,Cessieu,38,,,38064000AE0079,,,26,,,,,,,,,,1,3,Dépendance,,0,,,,,,5.377707,45.568121
2019-588234,2019-01-14,000001,Vente,1155,,,LE PILON,B046,38110,38064,Cessieu,38,,,38064000AL0019,,,,,,,,,,,,,0,,,,,T,terres,,,2888,5.377209,45.556329
2019-588317,2019-01-25,000001,Vente,165000,2,,IMP DES AUBEPINES,0030,38110,38064,Cessieu,38,,,38064000AH0028,,,,,,,,,,,,,0,1,Maison,100,5,S,sols,,,485,5.379279,45.567571
2019-588317,2019-01-25,000001,Vente,165000,,,LA PORTE D EN HAUT,B054,38110,38064,Cessieu,38,,,38064000AH0029,,,,,,,,,,,,,0,,,,,J,jardins,,,197,5.379384,45.567415
2019-588317,2019-01-25,000001,Vente,165000,,,LA PORTE D EN HAUT,B054,38110,38064,Cessieu,38,,,38064000AH0038,,,,,,,,,,,,,0,,,,,P,prés,,,1757,5.37957,45.567615
2019-588317,2019-01-25,000001,Vente,165000,,,LA PORTE D EN HAUT,B054,38110,38064,Cessieu,38,,,38064000AH0039,,,,,,,,,,,,,0,,,,,P,prés,,,235,5.379232,45.567685
2019-588317,2019-01-25,000001,Vente,165000,,,LA PORTE D EN HAUT,B054,38110,38064,Cessieu,38,,,38064000AH0040,,,,,,,,,,,,,0,,,,,BT,taillis simples,,,1357,5.379534,45.567963
2019-588317,2019-01-25,000001,Vente,165000,,,LA PORTE D EN HAUT,B054,38110,38064,Cessieu,38,,,38064000AH0041,,,,,,,,,,,,,0,,,,,BT,taillis simples,,,1948,5.380183,45.568084
2019-588504,2019-02-05,000001,Vente,1000,,,PRE DU BATTOIR EST,B056,38110,38064,Cessieu,38,,,38064000AE0339,,,,,,,,,,,,,0,,,,,BP,peupleraies,,,1007,5.370819,45.566081
2019-588511,2019-01-31,000001,Vente,200000,29,,CHE DES VERNES,1235,38110,38064,Cessieu,38,,,38064000AI0335,,,,,,,,,,,,,0,1,Maison,115,6,S,sols,,,1071,5.389721,45.564263
2019-588511,2019-01-31,000001,Vente,200000,,,LA PELISSE ET LE MARAIS,B042,38110,38064,Cessieu,38,,,38064000AI0338,,,,,,,,,,,,,0,,,,,L,landes,,,60,5.389478,45.564195
2019-588511,2019-01-31,000001,Vente,200000,,,LA PELISSE ET LE MARAIS,B042,38110,38064,Cessieu,38,,,38064000AI0340,,,,,,,,,,,,,0,,,,,L,landes,,,312,5.389555,45.564149
2019-588601,2019-02-11,000001,Vente,297000,,,PLAINE DU MILIEU,B049,38110,38064,Cessieu,38,,,38064000AL0515,,,,,,,,,,,,,0,,,,,S,sols,,,277,5.383104,45.564784
2019-588601,2019-02-11,000001,Vente,297000,1,,LE CLOS DES TILLEULS,A005,38110,38064,Cessieu,38,,,38064000AL0520,,,,,,,,,,,,,0,1,Maison,145,6,S,sols,,,532,5.383012,45.564799
2019-588633,2019-02-15,000001,Vente,147000,24,,RUE DU REVOL,0940,38110,38064,Cessieu,38,,,38064000AE0265,,,,,,,,,,,,,0,1,Maison,145,4,S,sols,,,198,5.375241,45.565408
2019-588713,2019-02-28,000002,Vente,96000,,,MONT BERTAUD,B040,38110,38064,Cessieu,38,,,380640000B2320,,,,,,,,,,,,,0,,,,,P,prés,,,1108,5.385715,45.575715
2019-588750,2019-02-19,000002,Vente,70000,32,,RUE DE LA FABRIQUE,0440,38110,38064,Cessieu,38,,,38064000AE0455,,,,,,,,,,,,,0,,,,,S,sols,,,73,5.371474,45.565392
2019-588750,2019-02-19,000002,Vente,70000,32,,RUE DE LA FABRIQUE,0440,38110,38064,Cessieu,38,,,38064000AE0534,,,,,,,,,,,,,0,,,,,S,sols,,,316,5.371568,45.565272
2019-588750,2019-02-19,000002,Vente,70000,32,,RUE DE LA FABRIQUE,0440,38110,38064,Cessieu,38,,,38064000AE0544,,,,,,,,,,,,,0,,,,,S,sols,,,76,5.371972,45.565225
2019-588750,2019-02-19,000002,Vente,70000,32,,RUE DE LA FABRIQUE,0440,38110,38064,Cessieu,38,,,38064000AE0546,,,,,,,,,,,,,0,,,,,S,sols,,,84,5.371755,45.565196
2019-588750,2019-02-19,000002,Vente,70000,32,,RUE DE LA FABRIQUE,0440,38110,38064,Cessieu,38,,,38064000AE0547,,,,,,,,,,,,,0,,,,,S,sols,,,134,5.371704,45.565259
2019-588750,2019-02-19,000002,Vente,70000,,,PRE DU BATTOIR EST,B056,38110,38064,Cessieu,38,,,38064000AE0549,,,,,,,,,,,,,0,,,,,P,prés,,,108,5.371741,45.565368
2019-588751,2019-02-19,000001,Vente,40000,32,,RUE DE LA FABRIQUE,0440,38110,38064,Cessieu,38,,,38064000AE0543,,,,,,,,,,,,,0,,,,,S,sols,,,126,5.371943,45.565268
2019-588751,2019-02-19,000001,Vente,40000,32,,RUE DE LA FABRIQUE,0440,38110,38064,Cessieu,38,,,38064000AE0545,,,,,,,,,,,,,0,1,Maison,100,4,S,sols,,,114,5.371815,45.565301
2019-588751,2019-02-19,000001,Vente,40000,32,,RUE DE LA FABRIQUE,0440,38110,38064,Cessieu,38,,,38064000AE0545,,,,,,,,,,,,,0,4,Local industriel. commercial ou assimilé,150,0,S,sols,,,114,5.371815,45.565301
2019-588751,2019-02-19,000001,Vente,40000,,,PRE DU BATTOIR EST,B056,38110,38064,Cessieu,38,,,38064000AE0548,,,,,,,,,,,,,0,,,,,P,prés,,,243,5.371886,45.565343
2019-588851,2019-03-06,000001,Vente,129450,144,,RTE DE LYON,0670,38110,38064,Cessieu,38,,,380640000B1312,,,,,,,,,,,,,0,1,Maison,88,4,S,sols,,,252,5.357193,45.568037
2019-589065,2019-03-25,000001,Vente,100000,12,,RUE DU REVOL,0940,38110,38064,Cessieu,38,,,38064000AE0263,,,,,,,,,,,,,0,4,Local industriel. commercial ou assimilé,246,0,S,sols,,,598,5.374981,45.565667
2019-589065,2019-03-25,000001,Vente,100000,,,QUARTIER DU REVOL,B059,38110,38064,Cessieu,38,,,38064000AE0429,,,,,,,,,,,,,0,,,,,P,prés,,,16,5.374997,45.565732
2019-589065,2019-03-25,000001,Vente,100000,,,QUARTIER DU REVOL,B059,38110,38064,Cessieu,38,,,38064000AE0432,,,,,,,,,,,,,0,,,,,J,jardins,,,21,5.375073,45.565727
2019-589430,2019-04-04,000001,Vente,89000,,,PERLLEY,B043,38110,38064,Cessieu,38,,,38064000AD0437,,,,,,,,,,,,,0,,,,,AB,terrains a bâtir,,,814,5.369775,45.564569
2019-589456,2019-05-02,000001,Vente,98000,,,MONT BERTAUD,B040,38110,38064,Cessieu,38,,,380640000B2319,,,,,,,,,,,,,0,,,,,P,prés,,,1156,5.385315,45.575853
2019-589503,2019-05-02,000001,Vente,321300,2,B,CHE DE PEVRIN,0850,38110,38064,Cessieu,38,,,380640000C1044,,,,,,,,,,,,,0,1,Maison,168,4,S,sols,,,592,5.407371,45.567545
2019-589510,2019-05-02,000001,Vente,110000,89,,RTE DE CHAMBERY,0175,38110,38064,Cessieu,38,,,38064000AH0115,,,,,,,,,,,,,0,1,Maison,75,4,S,sols,,,360,,
2019-589510,2019-05-02,000001,Vente,110000,84,,RTE DE CHAMBERY,0175,38110,38064,Cessieu,38,,,38064000AH0116,,,,,,,,,,,,,0,,,,,P,prés,,,246,,
2019-589510,2019-05-02,000001,Vente,110000,,,LA MADELEINE,B035,38110,38064,Cessieu,38,,,38064000AH0117,,,,,,,,,,,,,0,,,,,J,jardins,,,239,,
2019-589510,2019-05-02,000001,Vente,110000,,,COMBE LOUVIERE,B021,38110,38064,Cessieu,38,,,380640000B0614,,,,,,,,,,,,,0,,,,,P,prés,,,185,5.386123,45.566386
2019-589510,2019-05-02,000001,Vente,110000,,,COMBE LOUVIERE,B021,38110,38064,Cessieu,38,,,380640000B0616,,,,,,,,,,,,,0,,,,,P,prés,,,3231,5.386362,45.567246
2019-589582,2019-05-15,000001,Vente,150000,135,,RTE DE LYON,0670,38110,38064,Cessieu,38,,,380640000B1307,,,4,,,,,,,,,,1,1,Maison,79,4,,,,,,5.358314,45.567795
2019-589587,2019-05-07,000002,Vente,10000,,,PLAINE DU MARAIS,B048,38110,38064,Cessieu,38,,,38064000AK0277,,,,,,,,,,,,,0,,,,,T,terres,,,990,5.391882,45.562146
2019-589626,2019-04-30,000001,Vente,77000,11,,CHE DE THIVOLIERE,1130,38110,38064,Cessieu,38,,,38064000AC0201,,,,,,,,,,,,,0,1,Maison,107,3,S,sols,,,670,5.346165,45.569942
2019-589626,2019-04-30,000001,Vente,77000,,,CAVILLIERE,B011,38110,38064,Cessieu,38,,,38064000AC0203,,,,,,,,,,,,,0,,,,,P,prés,,,3570,5.346298,45.569623
2019-589691,2019-05-23,000001,Vente,128000,6,,MTE DES BALMETTES,0050,38110,38064,Cessieu,38,,,38064000AE0079,,,3,,,,,,,,,,1,2,Appartement,90,4,,,,,,5.377707,45.568121
2019-589691,2019-05-23,000001,Vente,128000,6,,MTE DES BALMETTES,0050,38110,38064,Cessieu,38,,,38064000AE0079,,,15,,,,,,,,,,1,3,Dépendance,,0,,,,,,5.377707,45.568121
2019-589691,2019-05-23,000001,Vente,128000,6,,MTE DES BALMETTES,0050,38110,38064,Cessieu,38,,,38064000AE0079,,,14,,,,,,,,,,1,3,Dépendance,,0,,,,,,5.377707,45.568121
2019-589710,2019-05-10,000001,Vente,201000,,,RIVE,B060,38110,38064,Cessieu,38,,,380640000C0933,,,,,,,,,,,,,0,,,,,P,prés,,,55,5.402351,45.568185
2019-589710,2019-05-10,000001,Vente,201000,,,RIVE,B060,38110,38064,Cessieu,38,,,380640000C0935,,,,,,,,,,,,,0,,,,,T,terres,,,56,5.402513,45.568202
2019-589710,2019-05-10,000001,Vente,201000,,,RIVE,B060,38110,38064,Cessieu,38,,,380640000C0936,,,,,,,,,,,,,0,,,,,T,terres,,,413,5.402608,45.568021
2019-589710,2019-05-10,000001,Vente,201000,27,,CHE DES RIVES,0950,38110,38064,Cessieu,38,,,380640000C1066,,,,,,,,,,,,,0,1,Maison,90,4,S,sols,,,419,5.402397,45.567972
2019-589760,2019-05-15,000001,Vente,171500,97,,RTE DE VERNAVENT,1230,38110,38064,Cessieu,38,,,380640000C0760,,,,,,,,,,,,,0,1,Maison,73,4,S,sols,,,1367,5.395201,45.575198
2019-589861,2019-06-11,000001,Vente,900,,,COMMUNAUX,B024,38110,38064,Cessieu,38,,,380640000A0998,,,,,,,,,,,,,0,,,,,T,terres,,,2960,5.361045,45.576569
2019-589911,2019-06-05,000001,Vente,187500,,,LE BOURG,B008,38110,38064,Cessieu,38,,,38064000AE0157,,,,,,,,,,,,,0,,,,,J,jardins,,,108,5.375931,45.566797
2019-589911,2019-06-05,000001,Vente,187500,14,,RUE GENERAL CASSIUS,0520,38110,38064,Cessieu,38,,,38064000AE0164,,,,,,,,,,,,,0,1,Maison,173,7,S,sols,,,362,5.376301,45.566822
2019-590038,2019-06-24,000001,Vente,1217765.4,,,COIRANNE,B018,38110,38064,Cessieu,38,,,38064000AB0079,,,,,,,,,,,,,0,,,,,L,landes,,,1240,5.33912,45.571241
2019-590038,2019-06-24,000001,Vente,1217765.4,,,COIRANNE,B018,38110,38064,Cessieu,38,,,38064000AB0084,,,,,,,,,,,,,0,,,,,P,prés,,,1230,5.339224,45.571459
2019-590038,2019-06-24,000001,Vente,1217765.4,,,PRE DU BATTOIR,B055,38110,38064,Cessieu,38,,,38064000AD0010,,,,,,,,,,,,,0,,,,,P,prés,,,2947,5.362713,45.566085
2019-590038,2019-06-24,000001,Vente,1217765.4,,,PRE DU BATTOIR,B055,38110,38064,Cessieu,38,,,38064000AD0014,,,,,,,,,,,,,0,,,,,P,prés,,,3745,5.363718,45.566217
2019-590038,2019-06-24,000001,Vente,1217765.4,,,PRE DU BATTOIR,B055,38110,38064,Cessieu,38,,,38064000AD0015,,,,,,,,,,,,,0,,,,,P,prés,,,2025,5.363423,45.566696
2019-590038,2019-06-24,000001,Vente,1217765.4,,,PRE DU BATTOIR,B055,38110,38064,Cessieu,38,,,38064000AD0016,,,,,,,,,,,,,0,,,,,P,prés,,,4390,5.362665,45.566913
2019-590038,2019-06-24,000001,Vente,1217765.4,,,PRE DU BATTOIR,B055,38110,38064,Cessieu,38,,,38064000AD0017,,,,,,,,,,,,,0,,,,,S,sols,,,2510,5.362757,45.567594
2019-590038,2019-06-24,000001,Vente,1217765.4,,,PRE DU BATTOIR,B055,38110,38064,Cessieu,38,,,38064000AD0018,,,,,,,,,,,,,0,,,,,BT,taillis simples,,,390,5.362664,45.567814
2019-590038,2019-06-24,000001,Vente,1217765.4,,,LA PELISSE ET LE MARAIS,B042,38110,38064,Cessieu,38,,,38064000AI0027,,,,,,,,,,,,,0,,,,,P,prés,,,7128,5.400639,45.564718
2019-590038,2019-06-24,000001,Vente,1217765.4,,,LA PELISSE ET LE MARAIS,B042,38110,38064,Cessieu,38,,,38064000AI0245,,,,,,,,,,,,,0,,,,,AB,terrains a bâtir,,,26,5.406629,45.564244
2019-590038,2019-06-24,000001,Vente,1217765.4,,,LA PELISSE ET LE MARAIS,B042,38110,38064,Cessieu,38,,,38064000AI0284,,,,,,,,,,,,,0,,,,,P,prés,,,463,5.408361,45.562789
2019-590038,2019-06-24,000001,Vente,1217765.4,,,LA PELISSE ET LE MARAIS,B042,38110,38064,Cessieu,38,,,38064000AI0286,,,,,,,,,,,,,0,,,,,S,sols,,,1527,5.407517,45.562697
2019-590038,2019-06-24,000001,Vente,1217765.4,,,LA PELISSE ET LE MARAIS,B042,38110,38064,Cessieu,38,,,38064000AI0287,,,,,,,,,,,,,0,,,,,P,prés,,,581,5.408825,45.562843
2019-590038,2019-06-24,000001,Vente,1217765.4,,,LA PELISSE ET LE MARAIS,B042,38110,38064,Cessieu,38,,,38064000AI0307,,,,,,,,,,,,,0,,,,,E,eaux,CANAL,Canal,224,5.406562,45.5647
2019-590038,2019-06-24,000001,Vente,1217765.4,,,LA PELISSE ET LE MARAIS,B042,38110,38064,Cessieu,38,,,38064000AI0310,,,,,,,,,,,,,0,,,,,E,eaux,CANAL,Canal,265,5.406655,45.563361
2019-590038,2019-06-24,000001,Vente,1217765.4,,,LA PELISSE ET LE MARAIS,B042,38110,38064,Cessieu,38,,,38064000AI0315,,,,,,,,,,,,,0,,,,,P,prés,,,213,5.409137,45.562879
2019-590038,2019-06-24,000001,Vente,1217765.4,,,LA PELISSE ET LE MARAIS,B042,38110,38064,Cessieu,38,,,38064000AI0317,,,,,,,,,,,,,0,,,,,P,prés,,,213,5.409328,45.562901
2019-590038,2019-06-24,000001,Vente,1217765.4,,,LA PELISSE ET LE MARAIS,B042,38110,38064,Cessieu,38,,,38064000AI0319,,,,,,,,,,,,,0,,,,,P,prés,,,420,5.409628,45.562935
2019-590038,2019-06-24,000001,Vente,1217765.4,,,LA PELISSE ET LE MARAIS,B042,38110,38064,Cessieu,38,,,38064000AI0321,,,,,,,,,,,,,0,,,,,BT,taillis simples,,,790,5.410189,45.563001
2019-590038,2019-06-24,000001,Vente,1217765.4,,,LA PELISSE ET LE MARAIS,B042,38110,38064,Cessieu,38,,,38064000AI0326,,,,,,,,,,,,,0,,,,,T,terres,,,3675,5.407794,45.560733
2019-590038,2019-06-24,000001,Vente,1217765.4,,,LA PELISSE ET LE MARAIS,B042,38110,38064,Cessieu,38,,,38064000AI0346,,,,,,,,,,,,,0,,,,,T,terres,,,54,5.406354,45.566295
2019-590038,2019-06-24,000001,Vente,1217765.4,,,LA PELISSE ET LE MARAIS,B042,38110,38064,Cessieu,38,,,38064000AI0348,,,,,,,,,,,,,0,,,,,T,terres,,,1090,5.405969,45.566637
2019-590038,2019-06-24,000001,Vente,1217765.4,9,,RTE DE LA ZONE INDUSTRIELLE,1270,38110,38064,Cessieu,38,,,38064000AI0351,,,,,,,,,,,,,0,,,,,S,sols,,,697,5.406813,45.566259
2019-590038,2019-06-24,000001,Vente,1217765.4,9001,,CHE DU PONT ROUGE,0895,38110,38064,Cessieu,38,,,38064000AI0363,,,,,,,,,,,,,0,4,Local industriel. commercial ou assimilé,,0,BP,peupleraies,,,2004,5.404927,45.563036
2019-590038,2019-06-24,000001,Vente,1217765.4,9001,,CHE DU PONT ROUGE,0895,38110,38064,Cessieu,38,,,38064000AI0363,,,,,,,,,,,,,0,4,Local industriel. commercial ou assimilé,,0,S,sols,,,8853,5.404927,45.563036
2019-590038,2019-06-24,000001,Vente,1217765.4,9001,,CHE DU PONT ROUGE,0895,38110,38064,Cessieu,38,,,38064000AI0363,,,,,,,,,,,,,0,4,Local industriel. commercial ou assimilé,,0,T,terres,,,10738,5.404927,45.563036
2019-590038,2019-06-24,000001,Vente,1217765.4,9001,,CHE DU PONT ROUGE,0895,38110,38064,Cessieu,38,,,38064000AI0363,,,,,,,,,,,,,0,4,Local industriel. commercial ou assimilé,,0,P,prés,,,17161,5.404927,45.563036
2019-590038,2019-06-24,000001,Vente,1217765.4,,,LA PELISSE ET LE MARAIS,B042,38110,38064,Cessieu,38,,,38064000AI0372,,,,,,,,,,,,,0,,,,,L,landes,,,288,5.403036,45.566577
2019-590038,2019-06-24,000001,Vente,1217765.4,,,LA PELISSE ET LE MARAIS,B042,38110,38064,Cessieu,38,,,38064000AI0373,,,,,,,,,,,,,0,,,,,P,prés,,,5642,5.404179,45.566161
2019-590038,2019-06-24,000001,Vente,1217765.4,,,LA PELISSE ET LE MARAIS,B042,38110,38064,Cessieu,38,,,38064000AI0374,,,,,,,,,,,,,0,,,,,S,sols,,,9206,5.403398,45.565684
2019-590038,2019-06-24,000001,Vente,1217765.4,,,LA PELISSE ET LE MARAIS,B042,38110,38064,Cessieu,38,,,38064000AI0375,,,,,,,,,,,,,0,,,,,P,prés,,,2137,5.401537,45.565355
2019-590038,2019-06-24,000001,Vente,1217765.4,,,LA PELISSE ET LE MARAIS,B042,38110,38064,Cessieu,38,,,38064000AI0376,,,,,,,,,,,,,0,,,,,P,prés,,,9262,5.403706,45.565607
2019-590038,2019-06-24,000001,Vente,1217765.4,,,LA PELISSE ET LE MARAIS,B042,38110,38064,Cessieu,38,,,38064000AI0377,,,,,,,,,,,,,0,,,,,P,prés,,,5999,5.404878,45.565541
2019-590038,2019-06-24,000001,Vente,1217765.4,,,LA PELISSE ET LE MARAIS,B042,38110,38064,Cessieu,38,,,38064000AI0378,,,,,,,,,,,,,0,,,,,P,prés,,,630,5.401,45.566027
2019-590038,2019-06-24,000001,Vente,1217765.4,,,LA PELISSE ET LE MARAIS,B042,38110,38064,Cessieu,38,,,38064000AI0379,,,,,,,,,,,,,0,,,,,T,terres,,,13316,5.401252,45.564343
2019-590038,2019-06-24,000001,Vente,1217765.4,,,LA PELISSE ET LE MARAIS,B042,38110,38064,Cessieu,38,,,38064000AI0380,,,,,,,,,,,,,0,,,,,P,prés,,,45,5.406393,45.565835
2019-590038,2019-06-24,000001,Vente,1217765.4,,,LA PELISSE ET LE MARAIS,B042,38110,38064,Cessieu,38,,,38064000AI0381,,,,,,,,,,,,,0,,,,,S,sols,,,79,5.406411,45.565562
2019-590038,2019-06-24,000001,Vente,1217765.4,,,PLAINE DU MARAIS,B048,38110,38064,Cessieu,38,,,38064000AK0144,,,,,,,,,,,,,0,,,,,L,landes,,,715,5.386952,45.558304
2019-590038,2019-06-24,000001,Vente,1217765.4,,,PLAINE DU REVOL,B051,38110,38064,Cessieu,38,,,38064000AL0086,,,,,,,,,,,,,0,,,,,T,terres,,,7661,5.377854,45.557627
2019-590038,2019-06-24,000001,Vente,1217765.4,,,PLAINE DU REVOL,B051,38110,38064,Cessieu,38,,,38064000AL0088,,,,,,,,,,,,,0,,,,,T,terres,,,15885,,
2019-590038,2019-06-24,000001,Vente,1217765.4,,,PLAINE DU REVOL,B051,38110,38064,Cessieu,38,,,38064000AL0089,,,,,,,,,,,,,0,,,,,T,terres,,,6376,,
2019-590038,2019-06-24,000001,Vente,1217765.4,,,PLAINE DU REVOL,B051,38110,38064,Cessieu,38,,,38064000AL0090,,,,,,,,,,,,,0,,,,,T,terres,,,6073,,
2019-590038,2019-06-24,000001,Vente,1217765.4,,,PLAINE DU MILIEU,B049,38110,38064,Cessieu,38,,,38064000AL0259,,,,,,,,,,,,,0,,,,,L,landes,,,370,5.386576,45.558462
2019-590038,2019-06-24,000001,Vente,1217765.4,,,PLAINE DU MILIEU,B049,38110,38064,Cessieu,38,,,38064000AL0293,,,,,,,,,,,,,0,,,,,S,sols,,,1568,5.385017,45.565053
2019-590038,2019-06-24,000001,Vente,1217765.4,,,LE DEVEY,B027,38110,38064,Cessieu,38,,,38064000AM0350,,,,,,,,,,,,,0,,,,,T,terres,,,620,5.373857,45.560189
2019-590038,2019-06-24,000001,Vente,1217765.4,,,LE DEVEY,B027,38110,38064,Cessieu,38,,,38064000AM0355,,,,,,,,,,,,,0,,,,,L,landes,,,88,5.374941,45.56036
2019-590038,2019-06-24,000001,Vente,1217765.4,,,LE DEVEY,B027,38110,38064,Cessieu,38,,,38064000AM0357,,,,,,,,,,,,,0,,,,,L,landes,,,85,5.373796,45.560533
2019-590038,2019-06-24,000001,Vente,1217765.4,,,COMBE LOUVIERE,B021,38110,38064,Cessieu,38,,,380640000B0645,,,,,,,,,,,,,0,,,,,BT,taillis simples,,,1940,5.385564,45.570507
2019-590038,2019-06-24,000001,Vente,1217765.4,,,RIVE,B060,38110,38064,Cessieu,38,,,380640000C0830,,,,,,,,,,,,,0,,,,,S,sols,,,626,5.405754,45.569562
2019-590084,2019-06-11,000001,Vente,180815,2,,CHE DES RIVES,0950,38110,38064,Cessieu,38,,,380640000C0275,,,,,,,,,,,,,0,1,Maison,139,4,S,sols,,,200,5.406312,45.56805
2019-590084,2019-06-11,000001,Vente,180815,,,PEVRIN,B070,38110,38064,Cessieu,38,,,380640000C0280,,,,,,,,,,,,,0,,,,,J,jardins,,,278,5.406038,45.567924
2019-590160,2019-06-28,000001,Vente,253000,2,,LOT LES PRES DE CESSIEU,A045,38110,38064,Cessieu,38,,,38064000AL0464,,,,,,,,,,,,,0,1,Maison,119,6,S,sols,,,800,5.379855,45.564091
2019-590178,2019-06-14,000001,Vente,110000,14,,CHE DE PEVRIN,0850,38110,38064,Cessieu,38,,,380640000C0267,,,,,,,,,,,,,0,1,Maison,92,4,S,sols,,,490,5.406847,45.567995
2019-590195,2019-06-18,000001,Vente,215000,,,VACHERE,B065,38110,38064,Cessieu,38,,,380640000B1651,,,,,,,,,,,,,0,,,,,S,sols,,,12,5.357379,45.567839
2019-590195,2019-06-18,000001,Vente,215000,4,,CHE DES ROSSIGNOLS,0990,38110,38064,Cessieu,38,,,380640000B2321,,,,,,,,,,,,,0,1,Maison,80,3,S,sols,,,517,5.357413,45.567763
2019-590273,2019-06-27,000001,Vente,109000,41,,RTE DE CHAMBERY,0175,38110,38064,Cessieu,38,,,38064000AH0045,,,,,,,,,,,,,0,1,Maison,84,4,S,sols,,,164,5.380295,45.567417
2019-590331,2019-07-09,000001,Vente,208000,30,,RTE DE VERNAVENT,1230,38110,38064,Cessieu,38,,,380640000B1678,,,,,,,,,,,,,0,1,Maison,92,4,S,sols,,,1046,5.388524,45.575317
2019-590366,2019-06-22,000001,Vente,100000,,,COMBE SAUNIE,B022,38110,38064,Cessieu,38,,,380640000A0566,,,,,,,,,,,,,0,,,,,BT,taillis simples,,,1540,5.354592,45.570955
2019-590366,2019-06-22,000001,Vente,100000,,,COMBE SAUNIE,B022,38110,38064,Cessieu,38,,,380640000A0567,,,,,,,,,,,,,0,,,,,L,landes,,,1360,5.353817,45.57106
2019-590366,2019-06-22,000001,Vente,100000,,,COMBE SAUNIE,B022,38110,38064,Cessieu,38,,,380640000A0570,,,,,,,,,,,,,0,,,,,VI,vignes,,,865,5.35364,45.56995
2019-590366,2019-06-22,000001,Vente,100000,,,COMBE SAUNIE,B022,38110,38064,Cessieu,38,,,380640000A0571,,,,,,,,,,,,,0,,,,,L,landes,,,1290,5.353788,45.570471
2019-590366,2019-06-22,000001,Vente,100000,,,COMBE SAUNIE,B022,38110,38064,Cessieu,38,,,380640000A0574,,,,,,,,,,,,,0,,,,,L,landes,,,1650,5.354342,45.569994
2019-590366,2019-06-22,000001,Vente,100000,,,COMBE SAUNIE,B022,38110,38064,Cessieu,38,,,380640000A0575,,,,,,,,,,,,,0,,,,,P,prés,,,1125,5.354442,45.569765
2019-590366,2019-06-22,000001,Vente,100000,15,,CHE DES MOUTTES,0770,38110,38064,Cessieu,38,,,380640000A0808,,,,,,,,,,,,,0,1,Maison,53,3,S,sols,,,370,5.353913,45.569995
2019-590415,2019-06-25,000001,Vente,62000,,,VACHERE,B065,38110,38064,Cessieu,38,,,380640000B1296,,,,,,,,,,,,,0,,,,,S,sols,,,278,5.358325,45.568238
2019-590437,2019-07-04,000001,Vente,215000,,,LA PORTE D EN HAUT,B054,38110,38064,Cessieu,38,,,38064000AH0062,,,,,,,,,,,,,0,,,,,BT,taillis simples,,,418,5.384523,45.566869
2019-590437,2019-07-04,000001,Vente,215000,73,,RTE DE CHAMBERY,0175,38110,38064,Cessieu,38,,,38064000AH0063,,,,,,,,,,,,,0,1,Maison,110,4,S,sols,,,489,5.384414,45.566666
2019-590437,2019-07-04,000001,Vente,215000,73,,RTE DE CHAMBERY,0175,38110,38064,Cessieu,38,,,38064000AH0063,,,,,,,,,,,,,0,4,Local industriel. commercial ou assimilé,27,0,S,sols,,,489,5.384414,45.566666
2019-590494,2019-07-09,000001,Vente,253000,26,,RUE DU CHAMP DE MARS,0180,38110,38064,Cessieu,38,,,38064000AE0236,,,,,,,,,,,,,0,1,Maison,90,4,S,sols,,,586,5.372882,45.565511
2019-590494,2019-07-09,000001,Vente,253000,,,QUARTIER DU REVOL,B059,38110,38064,Cessieu,38,,,38064000AE0388,,,,,,,,,,,,,0,,,,,J,jardins,,,311,5.372822,45.565732
2019-590555,2019-07-18,000001,Vente,2500,,,MONT BERTAUD,B040,38110,38064,Cessieu,38,,,380640000B2295,,,,,,,,,,,,,0,,,,,AB,terrains a bâtir,,,494,5.385655,45.577901
2019-590637,2019-07-22,000001,Vente,252700,1,,IMP DES HETRES LOT ECUREUILS,0590,38110,38064,Cessieu,38,,,38064000AL0313,,,,,,,,,,,,,0,1,Maison,85,4,S,sols,,,936,5.382244,45.564686
2019-590696,2019-07-27,000001,Vente,249900,49,,RTE DE CHAMBERY,0175,38110,38064,Cessieu,38,,,38064000AH0355,,,,,,,,,,,,,0,1,Maison,110,5,S,sols,,,492,5.381605,45.567042
2019-590696,2019-07-27,000001,Vente,249900,,,LES HURMES,B032,38110,38064,Cessieu,38,,,380640000B2102,,,,,,,,,,,,,0,,,,,P,prés,,,4372,5.381613,45.567503
2019-590736,2019-07-30,000001,Vente,294000,8,,CHE DES VERNES,1235,38110,38064,Cessieu,38,,,38064000AH0225,,,,,,,,,,,,,0,1,Maison,197,7,AG,terrains d'agrément,PARC,Parc,686,5.387715,45.56473