id_mutation,date_mutation,numero_disposition,nature_mutation,valeur_fonciere,adresse_numero,adresse_suffixe,adresse_nom_voie,adresse_code_voie,code_postal,code_commune,nom_commune,code_departement,ancien_code_commune,ancien_nom_commune,id_parcelle,ancien_id_parcelle,numero_volume,lot1_numero,lot1_surface_carrez,lot2_numero,lot2_surface_carrez,lot3_numero,lot3_surface_carrez,lot4_numero,lot4_surface_carrez,lot5_numero,lot5_surface_carrez,nombre_lots,code_type_local,type_local,surface_reelle_bati,nombre_pieces_principales,code_nature_culture,nature_culture,code_nature_culture_speciale,nature_culture_speciale,surface_terrain,longitude,latitude
2019-593097,2019-01-11,000001,Vente,177000,5278,,AU GUYARD,B016,38260,38161,Faramans,38,,,38161000AE0298,,,,,,,,,,,,,0,1,Maison,90,4,S,sols,,,1000,5.162286,45.391519
2019-593097,2019-01-11,000001,Vente,177000,5278,,AU GUYARD,B016,38260,38161,Faramans,38,,,38161000AE0298,,,,,,,,,,,,,0,1,Maison,90,4,J,jardins,,,630,5.162286,45.391519
2019-593268,2019-02-07,000001,Vente,2100,,,AUTIMONT,B001,38260,38161,Faramans,38,,,38161000AL0025,,,,,,,,,,,,,0,,,,,BT,taillis simples,,,4174,5.135776,45.378645
2019-593307,2019-01-17,000001,Vente,49000,223,,CHEM DE LA PORTE BLEUE,0027,38260,38161,Faramans,38,,,38161000AE0427,,,,,,,,,,,,,0,1,Maison,74,4,S,sols,,,571,5.163583,45.391987
2019-594534,2019-03-27,000002,Vente,116000,,,AU BERTHET,B002,38260,38161,Faramans,38,,,38161000AD0247,,,,,,,,,,,,,0,,,,,J,jardins,,,23,5.16609,45.393819
2019-594534,2019-03-27,000002,Vente,116000,,,AU BERTHET,B002,38260,38161,Faramans,38,,,38161000AD0248,,,,,,,,,,,,,0,,,,,J,jardins,,,11,5.166232,45.393792
2019-594534,2019-03-27,000002,Vente,116000,5085,,AU BERTHET,B002,38260,38161,Faramans,38,,,38161000AD0249,,,,,,,,,,,,,0,2,Appartement,160,6,S,sols,,,541,5.166071,45.393667
2019-595165,2019-06-11,000002,Echange,2000,734,,CHEM DES BRUYERES,0004,38260,38161,Faramans,38,,,38161000AK0645,,,,,,,,,,,,,0,,,,,S,sols,,,203,5.160533,45.378084
2019-595165,2019-06-11,000003,Echange,2000,,,HAMEAU DU SERCLIER,B018,38260,38161,Faramans,38,,,38161000AK0647,,,,,,,,,,,,,0,,,,,P,prés,,,654,5.160153,45.378276
2019-595241,2019-06-11,000001,Vente,162000,734,,CHEM DES BRUYERES,0004,38260,38161,Faramans,38,,,38161000AK0644,,,,,,,,,,,,,0,1,Maison,107,5,S,sols,,,1582,5.160637,45.378264
2019-595241,2019-06-11,000001,Vente,162000,,,HAMEAU DU SERCLIER,B018,38260,38161,Faramans,38,,,38161000AK0647,,,,,,,,,,,,,0,,,,,P,prés,,,654,5.160153,45.378276
2019-595594,2019-06-25,000001,Vente,300000,,,VILLAGE,B031,38260,38161,Faramans,38,,,38161000AE0303,,,,,,,,,,,,,0,,,,,S,sols,,,203,5.166338,45.389496
2019-595594,2019-06-25,000001,Vente,300000,,,CHANTEMERLE,B004,38260,38161,Faramans,38,,,38161000AH0009,,,,,,,,,,,,,0,,,,,J,jardins,,,948,5.165803,45.389232
2019-595594,2019-06-25,000001,Vente,300000,27,,CHEM DES PLANTEES,0028,38260,38161,Faramans,38,,,38161000AH0010,,,,,,,,,,,,,0,1,Maison,133,5,J,jardins,,,1407,5.166388,45.389226
2019-595594,2019-06-25,000001,Vente,300000,27,,CHEM DES PLANTEES,0028,38260,38161,Faramans,38,,,38161000AH0010,,,,,,,,,,,,,0,1,Maison,133,5,S,sols,,,1000,5.166388,45.389226
2019-595594,2019-06-25,000001,Vente,300000,,,CHANTEMERLE,B004,38260,38161,Faramans,38,,,38161000AH0011,,,,,,,,,,,,,0,,,,,T,terres,,,200,5.165818,45.389123
2019-595594,2019-06-25,000001,Vente,300000,,,CHANTEMERLE,B004,38260,38161,Faramans,38,,,38161000AH0012,,,,,,,,,,,,,0,,,,,T,terres,,,561,5.165793,45.389055
2019-595594,2019-06-25,000001,Vente,300000,,,CHANTEMERLE,B004,38260,38161,Faramans,38,,,38161000AH0013,,,,,,,,,,,,,0,,,,,T,terres,,,500,5.16583,45.388982
2019-595656,2019-05-09,000002,Vente,150,,,VILLAGE,B031,38260,38161,Faramans,38,,,38161000AE0453,,,,,,,,,,,,,0,,,,,J,jardins,,,4,5.16579,45.39245
2019-595659,2019-06-17,000001,Vente,1,,,VILLAGE,B031,38260,38161,Faramans,38,,,38161000AE0449,,,,,,,,,,,,,0,,,,,J,jardins,,,174,5.165763,45.392961
2019-595659,2019-06-17,000001,Vente,1,,,VILLAGE,B031,38260,38161,Faramans,38,,,38161000AE0451,,,,,,,,,,,,,0,,,,,J,jardins,,,867,,
2019-595843,2019-07-17,000002,Vente,58000,,,AU GUYARD,B016,38260,38161,Faramans,38,,,38161000AE0065,,,,,,,,,,,,,0,,,,,P,prés,,,2207,5.161031,45.392261
2019-595843,2019-07-17,000002,Vente,58000,,,AU GUYARD,B016,38260,38161,Faramans,38,,,38161000AE0444,,,,,,,,,,,,,0,,,,,P,prés,,,1003,5.160976,45.391768
2019-595870,2019-07-08,000001,Vente,110000,353,,CHEM DE LA CROZE,0012,38260,38161,Faramans,38,,,38161000AE0425,,,,,,,,,,,,,0,1,Maison,96,4,S,sols,,,600,5.163375,45.391594
2019-596145,2019-07-29,000001,Vente,173000,21,,CHEM DE LA CROZE,0012,38260,38161,Faramans,38,,,38161000AE0384,,,,,,,,,,,,,0,1,Maison,199,5,S,sols,,,814,5.162768,45.394288
2019-596395,2019-08-01,000001,Vente,2497,,,LES GROLLIERES,B015,38260,38161,Faramans,38,,,38161000ZI0009,,,,,,,,,,,,,0,,,,,T,terres,,,8917,5.150837,45.39748
2019-596469,2019-08-02,000002,Vente,1000,,,AU BERTHET,B002,38260,38161,Faramans,38,,,38161000AD0253,,,,,,,,,,,,,0,,,,,P,prés,,,1613,5.162964,45.395553
2019-596500,2019-08-29,000001,Vente,200,,,LES RAMELLES,B028,38260,38161,Faramans,38,,,38161000ZC0043,,,,,,,,,,,,,0,,,,,T,terres,,,238,5.149039,45.371807
2019-596500,2019-08-29,000001,Vente,200,,,LES RAMELLES,B028,38260,38161,Faramans,38,,,38161000ZC0043,,,,,,,,,,,,,0,,,,,BT,taillis simples,,,1432,5.149039,45.371807
2019-596625,2019-08-30,000001,Vente,120000,63,,AV DES MARAIS,0022,38260,38161,Faramans,38,,,38161000AD0191,,,,,,,,,,,,,0,1,Maison,100,4,S,sols,,,374,5.168256,45.393526
2019-596625,2019-08-30,000001,Vente,120000,,,AU BERTHET,B002,38260,38161,Faramans,38,,,38161000AD0192,,,,,,,,,,,,,0,,,,,S,sols,,,16,5.168171,45.393416
2019-596957,2019-09-02,000001,Vente,250000,,,VILLAGE,B031,38260,38161,Faramans,38,,,38161000AE0373,,,,,,,,,,,,,0,,,,,J,jardins,,,558,5.16437,45.3927
2019-596957,2019-09-02,000001,Vente,250000,15,,CHEM DU GUYARD,0020,38260,38161,Faramans,38,,,38161000AE0375,,,,,,,,,,,,,0,1,Maison,91,3,S,sols,,,359,5.164304,45.392766
2019-596957,2019-09-02,000001,Vente,250000,15,,CHEM DU GUYARD,0020,38260,38161,Faramans,38,,,38161000AE0375,,,,,,,,,,,,,0,1,Maison,190,4,S,sols,,,359,5.164304,45.392766
2019-597093,2019-09-27,000001,Vente,228000,539,,CHEM DU GUYARD,0020,38260,38161,Faramans,38,,,38161000AE0051,,,,,,,,,,,,,0,1,Maison,155,4,S,sols,,,626,5.158363,45.393097
2019-597155,2019-10-04,000001,Vente,552400,,,COMBE RONJOZ,B012,38260,38161,Faramans,38,,,38161000AI0324,,,,,,,,,,,,,0,,,,,S,sols,,,519,5.15755,45.386702
2019-597155,2019-10-04,000001,Vente,552400,528,,CHEM DE LA COMBE RONJOZ,0009,38260,38161,Faramans,38,,,38161000AI0328,,,,,,,,,,,,,0,1,Maison,256,9,J,jardins,,,2083,5.157979,45.386531
2019-597155,2019-10-04,000001,Vente,552400,528,,CHEM DE LA COMBE RONJOZ,0009,38260,38161,Faramans,38,,,38161000AI0328,,,,,,,,,,,,,0,1,Maison,256,9,S,sols,,,500,5.157979,45.386531
2019-597521,2019-10-22,000001,Vente,7210,,,CHANTEMERLE,B004,38260,38161,Faramans,38,,,38161000AH0034,,,,,,,,,,,,,0,,,,,T,terres,,,1442,,
2019-597523,2019-10-22,000001,Vente,14950,,,CHANTEMERLE,B004,38260,38161,Faramans,38,,,38161000AH0032,,,,,,,,,,,,,0,,,,,T,terres,,,2647,,
2019-597523,2019-10-22,000001,Vente,14950,,,CHANTEMERLE,B004,38260,38161,Faramans,38,,,38161000AH0033,,,,,,,,,,,,,0,,,,,P,prés,,,439,,
2019-597632,2019-10-08,000001,Vente,95000,273,,AV DES MARAIS,0022,38260,38161,Faramans,38,,,38161000AC0422,,,,,,,,,,,,,0,1,Maison,93,4,S,sols,,,426,5.171018,45.393709
2019-597970,2019-11-13,000001,Vente,36000,,,AU BERTHET,B002,38260,38161,Faramans,38,,,38161000AD0246,,,,,,,,,,,,,0,,,,,AB,terrains a bâtir,,,460,5.166224,45.393946
2019-597970,2019-11-13,000001,Vente,36000,,,AU BERTHET,B002,38260,38161,Faramans,38,,,38161000AD0250,,,,,,,,,,,,,0,,,,,S,sols,,,7,5.166187,45.393821
2019-598025,2019-11-22,000002,Vente,116000,5216,,AU GUYARD,B016,38260,38161,Faramans,38,,,38161000AE0456,,,,,,,,,,,,,0,1,Maison,120,3,S,sols,,,418,5.161904,45.393966
2019-598025,2019-11-22,000002,Vente,116000,,,AU GUYARD,B016,38260,38161,Faramans,38,,,38161000AE0459,,,,,,,,,,,,,0,,,,,AB,terrains a bâtir,,,9,5.161635,45.393965
2019-598101,2019-11-22,000001,Vente,271284.47,,,LES MARAIS,B021,38260,38161,Faramans,38,,,38161000ZA0061,,,,,,,,,,,,,0,,,,,L,landes,,,2230,5.176609,45.394974
2019-598101,2019-11-22,000001,Vente,271284.47,,,LES MARAIS,B021,38260,38161,Faramans,38,,,38161000ZA0062,,,,,,,,,,,,,0,,,,,T,terres,,,2060,5.177042,45.394929
2019-598101,2019-11-22,000001,Vente,271284.47,102,,CHEM DU STADE,0035,38260,38161,Faramans,38,,,38161000ZA0095,,,,,,,,,,,,,0,1,Maison,144,7,S,sols,,,3550,5.176364,45.394599
2019-598142,2019-11-08,000001,Vente,60000,150,,CHEM DU LOT,0021,38260,38161,Faramans,38,,,38161000AE0445,,,,,,,,,,,,,0,1,Maison,87,3,S,sols,,,1050,5.161056,45.39157
2019-598236,2019-11-28,000001,Vente,5660,,,PENDANT DU SUZON SUD,B039,38260,38161,Faramans,38,,,38161000ZE0074,,,,,,,,,,,,,0,,,,,T,terres,,,8847,5.128138,45.388328
2019-599063,2019-12-31,000001,Vente,190000,,,CHEM DE LA CHARRIERE,0041,38260,38161,Faramans,38,,,38161000AC0467,,,,,,,,,,,,,0,1,Maison,101,5,S,sols,,,720,5.171082,45.399125
2019-599083,2019-03-05,000001,Adjudication,37500,242,,RUE CENTRALE,0007,38260,38161,Faramans,38,,,38161000AD0101,,,2,,,,,,,,,,1,1,Maison,116,5,J,jardins,,,270,5.164768,45.393999
