id_mutation,date_mutation,numero_disposition,nature_mutation,valeur_fonciere,adresse_numero,adresse_suffixe,adresse_nom_voie,adresse_code_voie,code_postal,code_commune,nom_commune,code_departement,ancien_code_commune,ancien_nom_commune,id_parcelle,ancien_id_parcelle,numero_volume,lot1_numero,lot1_surface_carrez,lot2_numero,lot2_surface_carrez,lot3_numero,lot3_surface_carrez,lot4_numero,lot4_surface_carrez,lot5_numero,lot5_surface_carrez,nombre_lots,code_type_local,type_local,surface_reelle_bati,nombre_pieces_principales,code_nature_culture,nature_culture,code_nature_culture_speciale,nature_culture_speciale,surface_terrain,longitude,latitude
2019-577831,2019-03-05,000001,Vente,30000,,,FORTUNES,B010,38530,38166,La Flachère,38,,,381660000B0447,,,,,,,,,,,,,0,,,,,BS,taillis sous futaie,,,530,5.968996,45.394226
2019-577831,2019-03-05,000001,Vente,30000,,,FORTUNES,B010,38530,38166,La Flachère,38,,,381660000B0455,,,,,,,,,,,,,0,,,,,P,prés,,,900,5.968941,45.393621
2019-577831,2019-03-05,000001,Vente,30000,,,TONNAY,B024,38530,38166,La Flachère,38,,,381660000B0596,,,,,,,,,,,,,0,,,,,BT,taillis simples,,,970,5.968566,45.391643
2019-578179,2019-03-07,000002,Vente,130000,,,VILLAGE,B026,38530,38166,La Flachère,38,,,381660000B0771,,,,,,,,,,,,,0,,,,,S,sols,,,438,5.963935,45.397582
2019-578826,2019-04-26,000001,Vente,169570,5058,,IMP DE LA COUTURIERE,0045,38530,38166,La Flachère,38,,,381660000B0789,,,,,,,,,,,,,0,1,Maison,100,3,S,sols,,,80,5.962781,45.396601
2019-578826,2019-04-26,000001,Vente,169570,,,VILLAGE,B026,38530,38166,La Flachère,38,,,381660000B0791,,,,,,,,,,,,,0,,,,,S,sols,,,32,5.962751,45.39651
2019-578853,2019-04-24,000002,Vente,89000,,,RUE DE L EGLISE,0070,38530,38166,La Flachère,38,,,381660000A1161,,,,,,,,,,,,,0,,,,,S,sols,,,524,5.961922,45.397731
2019-579054,2019-05-21,000001,Vente,5300,,,LES PELOUSES,B017,38530,38166,La Flachère,38,,,381660000A0535,,,,,,,,,,,,,0,,,,,P,prés,,,565,5.958174,45.389838
2019-579382,2019-05-22,000001,Vente,322750,87,,CHE DES GRANDES TERRES,0100,38530,38166,La Flachère,38,,,381660000B0763,,,,,,,,,,,,,0,1,Maison,125,6,P,prés,,,1140,5.96625,45.405342
2019-579382,2019-05-22,000001,Vente,322750,87,,CHE DES GRANDES TERRES,0100,38530,38166,La Flachère,38,,,381660000B0763,,,,,,,,,,,,,0,1,Maison,125,6,S,sols,,,500,5.96625,45.405342
2019-580844,2019-08-02,000001,Vente,3684,,,ROGIER,B021,38530,38166,La Flachère,38,,,381660000A0538,,,,,,,,,,,,,0,,,,,P,prés,,,2970,5.957026,45.390337
2019-580844,2019-08-02,000001,Vente,3684,,,ROGIER,B021,38530,38166,La Flachère,38,,,381660000A0539,,,,,,,,,,,,,0,,,,,P,prés,,,1425,5.957495,45.390313
2019-580855,2019-08-02,000001,Vente,16782,,,ROTTY,B022,38530,38166,La Flachère,38,,,381660000B0383,,,,,,,,,,,,,0,,,,,T,terres,,,2431,5.96423,45.392155
2019-580939,2019-08-09,000001,Vente,220350,,,IMP DE LA CURE,0050,38530,38166,La Flachère,38,,,381660000A1095,,,,,,,,,,,,,0,,,,,S,sols,,,257,5.962545,45.397352
2019-580939,2019-08-09,000001,Vente,220350,528,,RUE DES BASSINS,0010,38530,38166,La Flachère,38,,,381660000A1098,,,3,96.38,,,,,,,,,1,2,Appartement,78,3,,,,,,5.962353,45.397455
2019-580939,2019-08-09,000001,Vente,220350,528,,RUE DES BASSINS,0010,38530,38166,La Flachère,38,,,381660000A1098,,,2,,,,,,,,,,1,3,Dépendance,,0,,,,,,5.962353,45.397455
2019-582058,2019-10-07,000001,Vente,90000,,,RUE DE L EGLISE,0070,38530,38166,La Flachère,38,,,381660000A0396,,,,,,,,,,,,,0,,,,,P,prés,,,771,,
2019-582058,2019-10-07,000001,Vente,90000,,,RUE DE L EGLISE,0070,38530,38166,La Flachère,38,,,381660000A1162,,,,,,,,,,,,,0,,,,,S,sols,,,162,,
2019-582143,2019-10-24,000001,Vente,1,,,GRANDES TERRES,B011,38530,38166,La Flachère,38,,,381660000B0885,,,,,,,,,,,,,0,,,,,S,sols,,,55,5.965742,45.406276
2019-582362,2019-10-11,000001,Vente,1,,,GRANDES TERRES,B011,38530,38166,La Flachère,38,,,381660000B0884,,,,,,,,,,,,,0,,,,,S,sols,,,66,5.965772,45.406219
2019-582362,2019-10-11,000001,Vente,1,,,GRANDES TERRES,B011,38530,38166,La Flachère,38,,,381660000B0886,,,,,,,,,,,,,0,,,,,S,sols,,,65,5.965733,45.406454
2019-582362,2019-10-11,000001,Vente,1,,,GRANDES TERRES,B011,38530,38166,La Flachère,38,,,381660000B0887,,,,,,,,,,,,,0,,,,,S,sols,,,20,5.965712,45.406717
2019-582710,2019-11-13,000001,Vente,327700,559,,RUE DES BASSINS,0010,38530,38166,La Flachère,38,,,381660000B0831,,,,,,,,,,,,,0,1,Maison,147,5,S,sols,,,397,5.962696,45.396979
2019-582733,2019-11-29,000001,Vente,329000,335,,CHE DE PIERRES PLATES,0150,38530,38166,La Flachère,38,,,381660000A0085,,,22,,,,,,,,,,1,1,Maison,110,5,,,,,,5.965118,45.405854
2019-583102,2019-12-19,000001,Vente,64000,,,VILLAGE,B026,38530,38166,La Flachère,38,,,381660000B0687,,,,,,,,,,,,,0,,,,,J,jardins,,,512,5.963622,45.399792
