id_mutation,date_mutation,numero_disposition,nature_mutation,valeur_fonciere,adresse_numero,adresse_suffixe,adresse_nom_voie,adresse_code_voie,code_postal,code_commune,nom_commune,code_departement,ancien_code_commune,ancien_nom_commune,id_parcelle,ancien_id_parcelle,numero_volume,lot1_numero,lot1_surface_carrez,lot2_numero,lot2_surface_carrez,lot3_numero,lot3_surface_carrez,lot4_numero,lot4_surface_carrez,lot5_numero,lot5_surface_carrez,nombre_lots,code_type_local,type_local,surface_reelle_bati,nombre_pieces_principales,code_nature_culture,nature_culture,code_nature_culture_speciale,nature_culture_speciale,surface_terrain,longitude,latitude
2019-577229,2019-01-21,000002,Vente,272630,1,,RUE DU MOULIN,0240,38570,38181,Goncelin,38,,,38181000AD0766,,,,,,,,,,,,,0,,,,,S,sols,,,5,5.979282,45.343775
2019-577229,2019-01-21,000002,Vente,272630,1,,RUE DU MOULIN,0240,38570,38181,Goncelin,38,,,38181000AD0768,,,,,,,,,,,,,0,,,,,S,sols,,,10,5.979212,45.343809
2019-577229,2019-01-21,000002,Vente,272630,,,LES TERRES DU PONT,B119,38570,38181,Goncelin,38,,,38181000AK0297,,,,,,,,,,,,,0,,,,,J,jardins,,,389,5.972837,45.340795
2019-577230,2019-01-21,000003,Vente,272430,1,,RUE DU MOULIN,0240,38570,38181,Goncelin,38,,,38181000AD0504,,,,,,,,,,,,,0,1,Maison,118,5,S,sols,,,106,5.979186,45.343763
2019-577325,2019-01-21,000001,Vente,170050,3,,RUE DU MOULIN,0240,38570,38181,Goncelin,38,,,38181000AD0765,,,,,,,,,,,,,0,1,Maison,92,5,S,sols,,,183,5.979403,45.343801
2019-577325,2019-01-21,000001,Vente,170050,3,,RUE DU MOULIN,0240,38570,38181,Goncelin,38,,,38181000AD0767,,,,,,,,,,,,,0,,,,,S,sols,,,202,5.97923,45.343848
2019-577403,2019-01-25,000001,Vente,1000,,,L ILON,B067,38570,38181,Goncelin,38,,,38181000AK0043,,,,,,,,,,,,,0,,,,,BP,peupleraies,,,1745,5.96651,45.342196
2019-577557,2019-01-28,000001,Vente,202500,8,,PL DE LA TANNERIE,0270,38570,38181,Goncelin,38,,,38181000AD0279,,,,,,,,,,,,,0,1,Maison,70,3,S,sols,,,59,5.979322,45.341969
2019-577659,2019-02-05,000001,Vente,4500,,,LES COTES,B035,38570,38181,Goncelin,38,,,38181000AH0195,,,,,,,,,,,,,0,,,,,P,prés,,,1414,5.974302,45.328199
2019-577659,2019-02-05,000001,Vente,4500,,,LES COTES,B035,38570,38181,Goncelin,38,,,38181000AH0274,,,,,,,,,,,,,0,,,,,S,sols,,,23,5.97439,45.327718
2019-577659,2019-02-05,000001,Vente,4500,,,LES COTES,B035,38570,38181,Goncelin,38,,,38181000AH0275,,,,,,,,,,,,,0,,,,,P,prés,,,4240,5.973917,45.327833
2019-577659,2019-02-05,000001,Vente,4500,,,LES COTES,B035,38570,38181,Goncelin,38,,,38181000AH0276,,,,,,,,,,,,,0,,,,,L,landes,PATUR,Pâture plantée,886,5.973639,45.328069
2019-577659,2019-02-05,000001,Vente,4500,,,LES COTES,B035,38570,38181,Goncelin,38,,,38181000AH0472,,,,,,,,,,,,,0,,,,,S,sols,,,1007,5.974174,45.327682
2019-577674,2019-02-01,000001,Vente,210000,1,,RTE DES ILES,0222,38570,38181,Goncelin,38,,,38181000AD0446,,,25,91.48,,,,,,,,,1,2,Appartement,89,3,,,,,,5.977722,45.34418
2019-577674,2019-02-01,000001,Vente,210000,1,,RTE DES ILES,0222,38570,38181,Goncelin,38,,,38181000AD0446,,,7,,,,,,,,,,1,3,Dépendance,,0,,,,,,5.977722,45.34418
2019-577706,2019-02-19,000001,Vente,106000,5,,RUE DU PONT DU CHANET,0265,38570,38181,Goncelin,38,,,38181000AE0315,,,,,,,,,,,,,0,1,Maison,65,3,S,sols,,,51,5.980578,45.342279
2019-577730,2019-02-13,000001,Vente,125000,,,CHEM DU PENSIONNAT,0262,38570,38181,Goncelin,38,,,38181000AD0709,,,,,,,,,,,,,0,,,,,AB,terrains a bâtir,,,13,5.978025,45.345007
2019-577730,2019-02-13,000001,Vente,125000,5,,CHEM DU PENSIONNAT,0262,38570,38181,Goncelin,38,,,38181000AD0735,,,12,47.32,,,,,,,,,1,2,Appartement,47,2,,,,,,5.978024,45.344872
2019-577748,2019-02-11,000001,Vente,1700,,,LE BOURG,B010,38570,38181,Goncelin,38,,,38181000AD0022,,,,,,,,,,,,,0,,,,,J,jardins,,,587,5.974055,45.340862
2019-577898,2019-02-22,000001,Vente,100,,,LE BOURG,B010,38570,38181,Goncelin,38,,,38181000AD0764,,,,,,,,,,,,,0,,,,,AB,terrains a bâtir,,,93,5.982927,45.3444
2019-578178,2019-03-08,000001,Vente,189200,15,,RTE DES THERMES,0276,38570,38181,Goncelin,38,,,38181000AD0123,,,,,,,,,,,,,0,1,Maison,82,4,S,sols,,,715,5.979965,45.345443
2019-578227,2019-03-23,000001,Vente,195000,2,,AV DES TIRIGNONS,0273,38570,38181,Goncelin,38,,,38181000AE0899,,,43,,,,,,,,,,1,3,Dépendance,,0,,,,,,5.977432,45.337071
2019-578227,2019-03-23,000001,Vente,195000,2,,AV DES TIRIGNONS,0273,38570,38181,Goncelin,38,,,38181000AE0899,,,49,67,,,,,,,,,1,2,Appartement,66,3,,,,,,5.977432,45.337071
2019-578245,2019-03-11,000001,Vente,267250,61,,LOT LE CHAMP DU BOURG,A040,38570,38181,Goncelin,38,,,38181000AB0360,,,,,,,,,,,,,0,1,Maison,116,5,S,sols,,,528,5.979314,45.346539
2019-578328,2019-03-25,000001,Vente,120000,25,,RUE DU CENOZ,0080,38570,38181,Goncelin,38,,,38181000AD0145,,,,,,,,,,,,,0,1,Maison,47,6,S,sols,,,445,,
2019-578332,2019-03-28,000001,Vente,112930,5,,RUE DU BREUIL,0022,38570,38181,Goncelin,38,,,38181000AD0312,,,2,47.3,,,,,,,,,1,2,Appartement,50,2,,,,,,5.979439,45.342437
2019-578337,2019-03-21,000002,Vente,20000,,,BAILLET,B003,38570,38181,Goncelin,38,,,38181000AE1033,,,,,,,,,,,,,0,,,,,BS,taillis sous futaie,,,509,5.981198,45.338743
2019-578337,2019-03-21,000002,Vente,20000,,,BAILLET,B003,38570,38181,Goncelin,38,,,38181000AE1034,,,,,,,,,,,,,0,,,,,AB,terrains a bâtir,,,359,,
2019-578337,2019-03-21,000002,Vente,20000,,,BAILLET,B003,38570,38181,Goncelin,38,,,38181000AE1035,,,,,,,,,,,,,0,,,,,AB,terrains a bâtir,,,7,5.980432,45.338967
2019-578341,2019-03-21,000002,Vente,325000,,,BAILLET,B003,38570,38181,Goncelin,38,,,38181000AE0538,,,,,,,,,,,,,0,,,,,L,landes,PATUR,Pâture plantée,630,5.979505,45.338947
2019-578341,2019-03-21,000002,Vente,325000,,,BAILLET,B003,38570,38181,Goncelin,38,,,38181000AE1007,,,,,,,,,,,,,0,,,,,BS,taillis sous futaie,,,2568,5.980871,45.338243
2019-578341,2019-03-21,000002,Vente,325000,,,BAILLET,B003,38570,38181,Goncelin,38,,,38181000AE1008,,,,,,,,,,,,,0,,,,,AB,terrains a bâtir,,,231,,
2019-578341,2019-03-21,000002,Vente,325000,,,BAILLET,B003,38570,38181,Goncelin,38,,,38181000AE1009,,,,,,,,,,,,,0,,,,,AB,terrains a bâtir,,,143,,
2019-578341,2019-03-21,000002,Vente,325000,,,BAILLET,B003,38570,38181,Goncelin,38,,,38181000AE1013,,,,,,,,,,,,,0,,,,,AB,terrains a bâtir,,,239,,
2019-578341,2019-03-21,000002,Vente,325000,,,BAILLET,B003,38570,38181,Goncelin,38,,,38181000AE1014,,,,,,,,,,,,,0,,,,,AB,terrains a bâtir,,,776,,
2019-578341,2019-03-21,000002,Vente,325000,,,BAILLET,B003,38570,38181,Goncelin,38,,,38181000AE1015,,,,,,,,,,,,,0,,,,,AB,terrains a bâtir,,,723,,
2019-578341,2019-03-21,000002,Vente,325000,,,BAILLET,B003,38570,38181,Goncelin,38,,,38181000AE1016,,,,,,,,,,,,,0,,,,,AB,terrains a bâtir,,,667,,
2019-578341,2019-03-21,000002,Vente,325000,,,BAILLET,B003,38570,38181,Goncelin,38,,,38181000AE1017,,,,,,,,,,,,,0,,,,,AB,terrains a bâtir,,,39,5.980149,45.338116
2019-578341,2019-03-21,000002,Vente,325000,,,BAILLET,B003,38570,38181,Goncelin,38,,,38181000AE1018,,,,,,,,,,,,,0,,,,,AB,terrains a bâtir,,,8,5.979962,45.338182
2019-578341,2019-03-21,000002,Vente,325000,,,BAILLET,B003,38570,38181,Goncelin,38,,,38181000AE1019,,,,,,,,,,,,,0,,,,,AB,terrains a bâtir,,,11,5.979895,45.338207
2019-578341,2019-03-21,000002,Vente,325000,,,BAILLET,B003,38570,38181,Goncelin,38,,,38181000AE1020,,,,,,,,,,,,,0,,,,,AB,terrains a bâtir,,,78,5.979988,45.338243
2019-578341,2019-03-21,000002,Vente,325000,,,BAILLET,B003,38570,38181,Goncelin,38,,,38181000AE1021,,,,,,,,,,,,,0,,,,,AB,terrains a bâtir,,,537,5.980163,45.338558
2019-578341,2019-03-21,000002,Vente,325000,,,BAILLET,B003,38570,38181,Goncelin,38,,,38181000AE1022,,,,,,,,,,,,,0,,,,,AB,terrains a bâtir,,,154,,
2019-578341,2019-03-21,000002,Vente,325000,,,BAILLET,B003,38570,38181,Goncelin,38,,,38181000AE1023,,,,,,,,,,,,,0,,,,,AB,terrains a bâtir,,,163,,
2019-578341,2019-03-21,000002,Vente,325000,,,BAILLET,B003,38570,38181,Goncelin,38,,,38181000AE1024,,,,,,,,,,,,,0,,,,,AB,terrains a bâtir,,,158,,
2019-578341,2019-03-21,000002,Vente,325000,,,BAILLET,B003,38570,38181,Goncelin,38,,,38181000AE1025,,,,,,,,,,,,,0,,,,,AB,terrains a bâtir,,,12,5.980172,45.338784
2019-578341,2019-03-21,000002,Vente,325000,,,BAILLET,B003,38570,38181,Goncelin,38,,,38181000AE1026,,,,,,,,,,,,,0,,,,,AB,terrains a bâtir,,,182,,
2019-578341,2019-03-21,000002,Vente,325000,,,BAILLET,B003,38570,38181,Goncelin,38,,,38181000AE1027,,,,,,,,,,,,,0,,,,,AB,terrains a bâtir,,,10,,
2019-578341,2019-03-21,000002,Vente,325000,,,BAILLET,B003,38570,38181,Goncelin,38,,,38181000AE1028,,,,,,,,,,,,,0,,,,,BS,taillis sous futaie,,,459,5.981056,45.338478
2019-578341,2019-03-21,000002,Vente,325000,,,BAILLET,B003,38570,38181,Goncelin,38,,,38181000AE1029,,,,,,,,,,,,,0,,,,,AB,terrains a bâtir,,,74,,
2019-578341,2019-03-21,000002,Vente,325000,,,BAILLET,B003,38570,38181,Goncelin,38,,,38181000AE1036,,,,,,,,,,,,,0,,,,,BS,taillis sous futaie,,,630,5.981258,45.338834
2019-578341,2019-03-21,000002,Vente,325000,,,BAILLET,B003,38570,38181,Goncelin,38,,,38181000AE1037,,,,,,,,,,,,,0,,,,,AB,terrains a bâtir,,,560,,
2019-578341,2019-03-21,000002,Vente,325000,,,BAILLET,B003,38570,38181,Goncelin,38,,,38181000AE1038,,,,,,,,,,,,,0,,,,,AB,terrains a bâtir,,,4,5.980451,45.339024
2019-578341,2019-03-21,000002,Vente,325000,,,BAILLET,B003,38570,38181,Goncelin,38,,,38181000AE1039,,,,,,,,,,,,,0,,,,,AB,terrains a bâtir,,,679,5.980141,45.339326
2019-578341,2019-03-21,000002,Vente,325000,,,BAILLET,B003,38570,38181,Goncelin,38,,,38181000AE1040,,,,,,,,,,,,,0,,,,,AB,terrains a bâtir,,,986,,
2019-578341,2019-03-21,000002,Vente,325000,,,BAILLET,B003,38570,38181,Goncelin,38,,,38181000AE1041,,,,,,,,,,,,,0,,,,,AB,terrains a bâtir,,,795,,
2019-578341,2019-03-21,000002,Vente,325000,,,BAILLET,B003,38570,38181,Goncelin,38,,,38181000AE1042,,,,,,,,,,,,,0,,,,,AB,terrains a bâtir,,,600,,
2019-578341,2019-03-21,000002,Vente,325000,,,BAILLET,B003,38570,38181,Goncelin,38,,,38181000AE1043,,,,,,,,,,,,,0,,,,,AB,terrains a bâtir,,,624,,
2019-578341,2019-03-21,000002,Vente,325000,,,BAILLET,B003,38570,38181,Goncelin,38,,,38181000AE1044,,,,,,,,,,,,,0,,,,,AB,terrains a bâtir,,,611,,
2019-578341,2019-03-21,000002,Vente,325000,,,BAILLET,B003,38570,38181,Goncelin,38,,,38181000AE1045,,,,,,,,,,,,,0,,,,,T,terres,,,48,5.979714,45.338276
2019-578341,2019-03-21,000002,Vente,325000,,,BAILLET,B003,38570,38181,Goncelin,38,,,38181000AE1046,,,,,,,,,,,,,0,,,,,T,terres,,,351,5.979528,45.338746
2019-578341,2019-03-21,000002,Vente,325000,,,BAILLET,B003,38570,38181,Goncelin,38,,,38181000AE1047,,,,,,,,,,,,,0,,,,,T,terres,,,1710,5.979881,45.339054
2019-578341,2019-03-21,000002,Vente,325000,,,BAILLET,B003,38570,38181,Goncelin,38,,,38181000AE1048,,,,,,,,,,,,,0,,,,,AB,terrains a bâtir,,,792,5.980382,45.339318
2019-578341,2019-03-21,000002,Vente,325000,,,BAILLET,B003,38570,38181,Goncelin,38,,,38181000AE1049,,,,,,,,,,,,,0,,,,,AB,terrains a bâtir,,,129,5.980388,45.339412
2019-578341,2019-03-21,000002,Vente,325000,,,BAILLET,B003,38570,38181,Goncelin,38,,,38181000AE1050,,,,,,,,,,,,,0,,,,,AB,terrains a bâtir,,,292,5.980424,45.339388
2019-578341,2019-03-21,000002,Vente,325000,,,BAILLET,B003,38570,38181,Goncelin,38,,,38181000AE1051,,,,,,,,,,,,,0,,,,,AB,terrains a bâtir,,,14,5.980461,45.33914
2019-578341,2019-03-21,000002,Vente,325000,,,BAILLET,B003,38570,38181,Goncelin,38,,,38181000AE1052,,,,,,,,,,,,,0,,,,,AB,terrains a bâtir,,,7,,
2019-578460,2019-03-22,000002,Vente,106732.53,5000,,ZA CHARTREUSE,A049,38570,38181,Goncelin,38,,,38181000AH0833,,,,,,,,,,,,,0,4,Local industriel. commercial ou assimilé,186,0,S,sols,,,3273,5.969259,45.329462
2019-578461,2019-03-22,000003,Vente,55127.06,,,VILLARD BOZON,B123,38570,38181,Goncelin,38,,,38181000AH0837,,,,,,,,,,,,,0,,,,,S,sols,,,1759,5.969958,45.329722
2019-578543,2019-04-01,000002,Vente,4000,,,LES COTES,B035,38570,38181,Goncelin,38,,,38181000AH0715,,,,,,,,,,,,,0,,,,,T,terres,,,292,5.977447,45.32932
2019-578609,2019-04-08,000001,Vente,176630,1,,RTE DES ILES,0222,38570,38181,Goncelin,38,,,38181000AD0446,,,29,76.03,,,,,,,,,1,2,Appartement,74,3,,,,,,5.977722,45.34418
2019-578609,2019-04-08,000001,Vente,176630,1,,RTE DES ILES,0222,38570,38181,Goncelin,38,,,38181000AD0446,,,4,,,,,,,,,,1,3,Dépendance,,0,,,,,,5.977722,45.34418
2019-578610,2019-04-08,000001,Vente,15000,2,,PL DE LA MAIRIE,0230,38570,38181,Goncelin,38,,,38181000AD0446,,,58,,,,,,,,,,1,3,Dépendance,,0,,,,,,5.977722,45.34418
2019-578641,2019-04-11,000001,Vente,196,,,LES GORGES,B054,38570,38181,Goncelin,38,,,381810000C0329,,,,,,,,,,,,,0,,,,,BT,taillis simples,,,1960,6.001772,45.340231
2019-578767,2019-04-09,000002,Vente,1,,,GRAND BACON,B057,38570,38181,Goncelin,38,,,38181000AI0144,,,,,,,,,,,,,0,,,,,BP,peupleraies,,,746,5.965823,45.331962
2019-578950,2019-03-15,000001,Vente,552,,,L ILON,B067,38570,38181,Goncelin,38,,,38181000AK0007,,,,,,,,,,,,,0,,,,,L,landes,MARAI,Pré marais,1310,5.964856,45.336776
2019-578965,2019-03-19,000001,Vente,1744.38,,,LES TERRES DU PONT,B119,38570,38181,Goncelin,38,,,38181000AK0271,,,,,,,,,,,,,0,,,,,P,prés,,,810,5.972182,45.342189
2019-578965,2019-03-19,000001,Vente,1744.38,,,LES TERRES DU PONT,B119,38570,38181,Goncelin,38,,,38181000AK0272,,,,,,,,,,,,,0,,,,,P,prés,,,71,5.972,45.342366
2019-579017,2019-03-21,000002,Vente,6000,,,BAILLET,B003,38570,38181,Goncelin,38,,,38181000AE1010,,,,,,,,,,,,,0,,,,,BS,taillis sous futaie,,,721,5.980967,45.338423
2019-579017,2019-03-21,000002,Vente,6000,,,BAILLET,B003,38570,38181,Goncelin,38,,,38181000AE1011,,,,,,,,,,,,,0,,,,,AB,terrains a bâtir,,,78,,
2019-579017,2019-03-21,000002,Vente,6000,,,BAILLET,B003,38570,38181,Goncelin,38,,,38181000AE1012,,,,,,,,,,,,,0,,,,,AB,terrains a bâtir,,,46,,
2019-579022,2019-03-21,000002,Vente,17000,,,BAILLET,B003,38570,38181,Goncelin,38,,,38181000AE1004,,,,,,,,,,,,,0,,,,,BS,taillis sous futaie,,,1030,5.980736,45.337992
2019-579022,2019-03-21,000002,Vente,17000,,,BAILLET,B003,38570,38181,Goncelin,38,,,38181000AE1005,,,,,,,,,,,,,0,,,,,AB,terrains a bâtir,,,153,,
2019-579022,2019-03-21,000002,Vente,17000,,,BAILLET,B003,38570,38181,Goncelin,38,,,38181000AE1006,,,,,,,,,,,,,0,,,,,BS,taillis sous futaie,,,2,5.980269,45.33807
2019-579025,2019-03-21,000002,Vente,12300,,,BAILLET,B003,38570,38181,Goncelin,38,,,38181000AE1030,,,,,,,,,,,,,0,,,,,BT,taillis simples,,,1294,5.981136,45.338584
2019-579025,2019-03-21,000002,Vente,12300,,,BAILLET,B003,38570,38181,Goncelin,38,,,38181000AE1031,,,,,,,,,,,,,0,,,,,AB,terrains a bâtir,,,187,,
2019-579025,2019-03-21,000002,Vente,12300,,,BAILLET,B003,38570,38181,Goncelin,38,,,38181000AE1032,,,,,,,,,,,,,0,,,,,AB,terrains a bâtir,,,53,,
2019-579133,2019-05-21,000001,Vente,220900,,,LES GORGES,B054,38570,38181,Goncelin,38,,,381810000C0575,,,,,,,,,,,,,0,,,,,BT,taillis simples,,,250,5.998331,45.329823
2019-579133,2019-05-21,000001,Vente,220900,,,L ADRET,B001,38570,38181,Goncelin,38,,,381810000C0586,,,,,,,,,,,,,0,,,,,BT,taillis simples,,,2193,5.999181,45.330229
2019-579133,2019-05-21,000001,Vente,220900,,,L ADRET,B001,38570,38181,Goncelin,38,,,381810000C0587,,,,,,,,,,,,,0,,,,,S,sols,,,690,5.998831,45.330332
2019-579133,2019-05-21,000001,Vente,220900,,,L ADRET,B001,38570,38181,Goncelin,38,,,381810000C0588,,,,,,,,,,,,,0,,,,,S,sols,,,68,5.998691,45.330132
2019-579133,2019-05-21,000001,Vente,220900,,,L ADRET,B001,38570,38181,Goncelin,38,,,381810000C0589,,,,,,,,,,,,,0,,,,,P,prés,,,32,5.998632,45.330098
2019-579133,2019-05-21,000001,Vente,220900,5748,,L ADRET,B001,38570,38181,Goncelin,38,,,381810000C0590,,,,,,,,,,,,,0,1,Maison,54,3,S,sols,,,55,5.998352,45.330051
2019-579133,2019-05-21,000001,Vente,220900,,,L ADRET,B001,38570,38181,Goncelin,38,,,381810000C0591,,,,,,,,,,,,,0,,,,,P,prés,,,4577,5.998206,45.330026
2019-579133,2019-05-21,000001,Vente,220900,,,L ADRET,B001,38570,38181,Goncelin,38,,,381810000C0592,,,,,,,,,,,,,0,,,,,P,prés,,,5195,5.997971,45.330307
2019-579214,2019-03-19,000001,Vente,4830,,,L ILON,B067,38570,38181,Goncelin,38,,,38181000AB0005,,,,,,,,,,,,,0,,,,,BT,taillis simples,,,2489,5.970416,45.351581
2019-579305,2019-05-17,000001,Vente,135000,2,,RTE DES ILES,0222,38570,38181,Goncelin,38,,,38181000AD0699,,,8,,,,,,,,,,1,3,Dépendance,,0,,,,,,5.977963,45.344329
2019-579305,2019-05-17,000001,Vente,135000,2,,RTE DES ILES,0222,38570,38181,Goncelin,38,,,38181000AD0699,,,1,,,,,,,,,,1,2,Appartement,90,1,,,,,,5.977963,45.344329
2019-579305,2019-05-17,000001,Vente,135000,2,,RTE DES ILES,0222,38570,38181,Goncelin,38,,,38181000AD0728,,,,,,,,,,,,,0,,,,,AB,terrains a bâtir,,,14,5.978106,45.344365
2019-579305,2019-05-17,000001,Vente,135000,5,,CHEM DU PENSIONNAT,0262,38570,38181,Goncelin,38,,,38181000AD0733,,,2,,,,,,,,,,1,3,Dépendance,,0,,,,,,5.978308,45.344669
2019-579383,2019-04-30,000001,Vente,195000,2,,AV DES TIRIGNONS,0273,38570,38181,Goncelin,38,,,38181000AE0899,,,23,,,,,,,,,,1,2,Appartement,80,4,,,,,,5.977432,45.337071
2019-579383,2019-04-30,000001,Vente,195000,2,,AV DES TIRIGNONS,0273,38570,38181,Goncelin,38,,,38181000AE0899,,,66,,,,,,,,,,1,3,Dépendance,,0,,,,,,5.977432,45.337071
2019-579383,2019-04-30,000001,Vente,195000,2,,AV DES TIRIGNONS,0273,38570,38181,Goncelin,38,,,38181000AE0899,,,4,,,,,,,,,,1,3,Dépendance,,0,,,,,,5.977432,45.337071
2019-579458,2019-05-24,000001,Vente,50000,1,,IMP DES ECUREUILS,0150,38570,38181,Goncelin,38,,,38181000AD0391,,,4,,8,25.39,,,,,,,2,2,Appartement,28,2,,,,,,5.977724,45.34197
2019-579529,2019-06-14,000001,Vente,380997,6,,RTE DES THERMES,0276,38570,38181,Goncelin,38,,,38181000AD0136,,,,,,,,,,,,,0,1,Maison,112,4,S,sols,,,845,5.980757,45.344954
2019-579577,2019-03-19,000001,Vente,50,,,LES TERRES DU PONT,B119,38570,38181,Goncelin,38,,,38181000AK0300,,,,,,,,,,,,,0,,,,,S,sols,,,11,5.97255,45.346052
2019-579710,2019-06-11,000001,Vente,190000,5,,RTE DES ILES,0222,38570,38181,Goncelin,38,,,38181000AD0446,,,97,,,,,,,,,,1,3,Dépendance,,0,,,,,,5.977722,45.34418
2019-579710,2019-06-11,000001,Vente,190000,5,,RTE DES ILES,0222,38570,38181,Goncelin,38,,,38181000AD0446,,,118,62.31,,,,,,,,,1,2,Appartement,66,3,,,,,,5.977722,45.34418
2019-579940,2019-06-28,000001,Vente,700,,,LE CHATEAU,B024,38570,38181,Goncelin,38,,,38181000AE0353,,,,,,,,,,,,,0,,,,,BS,taillis sous futaie,,,2960,5.983482,45.341541
2019-579983,2019-06-26,000001,Vente,321795,42,,LOT LE CHAMP DU BOURG,A040,38570,38181,Goncelin,38,,,38181000AB0341,,,,,,,,,,,,,0,1,Maison,125,4,S,sols,,,553,5.978135,45.348394
2019-580012,2019-07-15,000001,Vente,156000,16,,LOT COTE BRIZET,A070,38570,38181,Goncelin,38,,,38181000AB0403,,,,,,,,,,,,,0,1,Maison,96,5,S,sols,,,425,5.979713,45.349178
2019-580051,2019-06-28,000001,Vente,294000,40,,LOT LE CHAMP DU BOURG,A040,38570,38181,Goncelin,38,,,38181000AB0339,,,,,,,,,,,,,0,1,Maison,99,5,S,sols,,,595,5.978354,45.348058
2019-580067,2019-06-28,000001,Vente,124900,2,,RUE PORTE PAILLAC,0266,38570,38181,Goncelin,38,,,38181000AD0455,,,44,65.85,,,,,,,,,1,2,Appartement,66,4,,,,,,5.978577,45.343242
2019-580067,2019-06-28,000001,Vente,124900,2,,RUE PORTE PAILLAC,0266,38570,38181,Goncelin,38,,,38181000AD0455,,,13,,,,,,,,,,1,3,Dépendance,,0,,,,,,5.978577,45.343242
2019-580119,2019-07-05,000001,Vente,79000,44,,AV DES TIRIGNONS,0273,38570,38181,Goncelin,38,,,38181000AD0163,,,,,,,,,,,,,0,1,Maison,70,3,S,sols,,,69,5.978788,45.344082
2019-580334,2019-07-01,000001,Vente,364550,3,,LOT LE GRAND PRE,A073,38570,38181,Goncelin,38,,,38181000AE0937,,,,,,,,,,,,,0,1,Maison,112,5,S,sols,,,730,5.976327,45.337868
2019-580335,2019-07-18,000001,Vente,262900,41,,LOT LE CHAMP DU BOURG,A040,38570,38181,Goncelin,38,,,38181000AB0340,,,,,,,,,,,,,0,1,Maison,88,4,S,sols,,,522,5.978369,45.348246
2019-580431,2019-07-19,000001,Vente,140900,21,,AV DES TIRIGNONS,0273,38570,38181,Goncelin,38,,,38181000AD0004,,,,,,,,,,,,,0,1,Maison,100,5,S,sols,,,200,5.977013,45.34107
2019-580449,2019-07-22,000001,Vente,78000,,,LE CHATEAU,B024,38570,38181,Goncelin,38,,,38181000AE1001,,,,,,,,,,,,,0,,,,,AB,terrains a bâtir,,,330,5.980263,45.341823
2019-580449,2019-07-22,000001,Vente,78000,,,LE CHATEAU,B024,38570,38181,Goncelin,38,,,38181000AE1002,,,,,,,,,,,,,0,,,,,S,sols,,,15,5.980344,45.341765
2019-580450,2019-07-22,000001,Vente,111000,2,,RUE PORTE PAILLAC,0266,38570,38181,Goncelin,38,,,38181000AD0455,,,19,,,,,,,,,,1,3,Dépendance,,0,,,,,,5.978577,45.343242
2019-580450,2019-07-22,000001,Vente,111000,2,,RUE PORTE PAILLAC,0266,38570,38181,Goncelin,38,,,38181000AD0455,,,38,,,,,,,,,,1,2,Appartement,66,4,,,,,,5.978577,45.343242
2019-580647,2019-08-14,000001,Vente,16000,5,,CHEM DU PENSIONNAT,0262,38570,38181,Goncelin,38,,,38181000AD0733,,,11,,,,,,,,,,1,3,Dépendance,,0,,,,,,5.978308,45.344669
2019-580890,2019-08-09,000001,Vente,247350,6,,RTE DES THERMES,0276,38570,38181,Goncelin,38,,,38181000AD0131,,,,,,,,,,,,,0,1,Maison,98,4,S,sols,,,800,5.980292,45.345038
2019-580890,2019-08-09,000001,Vente,247350,6,,RTE DES THERMES,0276,38570,38181,Goncelin,38,,,38181000AD0132,,,,,,,,,,,,,0,,,,,S,sols,,,835,5.980394,45.344988
2019-581201,2019-08-26,000001,Vente,105000,,,RUCHE,B108,38570,38181,Goncelin,38,,,381810000E0296,,,,,,,,,,,,,0,,,,,P,prés,,,271,6.000923,45.326582
2019-581201,2019-08-26,000001,Vente,105000,,,RUCHE,B108,38570,38181,Goncelin,38,,,381810000E0297,,,,,,,,,,,,,0,,,,,P,prés,,,272,6.000807,45.326455
2019-581201,2019-08-26,000001,Vente,105000,,,RUCHE,B108,38570,38181,Goncelin,38,,,381810000E0304,,,,,,,,,,,,,0,,,,,P,prés,,,40,6.00095,45.326782
2019-581201,2019-08-26,000001,Vente,105000,,,RUCHE,B108,38570,38181,Goncelin,38,,,381810000E0305,,,,,,,,,,,,,0,,,,,S,sols,,,158,6.001014,45.326813
2019-581201,2019-08-26,000001,Vente,105000,,,RUCHE,B108,38570,38181,Goncelin,38,,,381810000E0306,,,,,,,,,,,,,0,,,,,P,prés,,,171,6.000988,45.32669
2019-581201,2019-08-26,000001,Vente,105000,5030,,RUCHE,B108,38570,38181,Goncelin,38,,,381810000E0307,,,,,,,,,,,,,0,1,Maison,125,6,S,sols,,,215,6.000807,45.326811
2019-581201,2019-08-26,000001,Vente,105000,,,RUCHE,B108,38570,38181,Goncelin,38,,,381810000E0437,,,,,,,,,,,,,0,,,,,BT,taillis simples,,,244,6.000946,45.326472
2019-581201,2019-08-26,000001,Vente,105000,,,RUCHE,B108,38570,38181,Goncelin,38,,,381810000E0439,,,,,,,,,,,,,0,,,,,BT,taillis simples,,,58,6.001081,45.326597
2019-581649,2019-09-18,000001,Vente,154000,,,BAILLET,B003,38570,38181,Goncelin,38,,,38181000AE1006,,,,,,,,,,,,,0,,,,,BS,taillis sous futaie,,,2,5.980269,45.33807
2019-581649,2019-09-18,000001,Vente,154000,,,BAILLET,B003,38570,38181,Goncelin,38,,,38181000AE1017,,,,,,,,,,,,,0,,,,,AB,terrains a bâtir,,,39,5.980149,45.338116
2019-581649,2019-09-18,000001,Vente,154000,,,BAILLET,B003,38570,38181,Goncelin,38,,,38181000AE1018,,,,,,,,,,,,,0,,,,,AB,terrains a bâtir,,,8,5.979962,45.338182
2019-581649,2019-09-18,000001,Vente,154000,,,BAILLET,B003,38570,38181,Goncelin,38,,,38181000AE1019,,,,,,,,,,,,,0,,,,,AB,terrains a bâtir,,,11,5.979895,45.338207
2019-581649,2019-09-18,000001,Vente,154000,,,BAILLET,B003,38570,38181,Goncelin,38,,,38181000AE1020,,,,,,,,,,,,,0,,,,,AB,terrains a bâtir,,,78,5.979988,45.338243
2019-581649,2019-09-18,000001,Vente,154000,,,BAILLET,B003,38570,38181,Goncelin,38,,,38181000AE1021,,,,,,,,,,,,,0,,,,,AB,terrains a bâtir,,,537,5.980163,45.338558
2019-581649,2019-09-18,000001,Vente,154000,,,BAILLET,B003,38570,38181,Goncelin,38,,,38181000AE1025,,,,,,,,,,,,,0,,,,,AB,terrains a bâtir,,,12,5.980172,45.338784
2019-581649,2019-09-18,000001,Vente,154000,,,BAILLET,B003,38570,38181,Goncelin,38,,,38181000AE1027,,,,,,,,,,,,,0,,,,,AB,terrains a bâtir,,,10,,
2019-581649,2019-09-18,000001,Vente,154000,,,BAILLET,B003,38570,38181,Goncelin,38,,,38181000AE1035,,,,,,,,,,,,,0,,,,,AB,terrains a bâtir,,,7,5.980432,45.338967
2019-581649,2019-09-18,000001,Vente,154000,,,BAILLET,B003,38570,38181,Goncelin,38,,,38181000AE1038,,,,,,,,,,,,,0,,,,,AB,terrains a bâtir,,,4,5.980451,45.339024
2019-581649,2019-09-18,000001,Vente,154000,,,BAILLET,B003,38570,38181,Goncelin,38,,,38181000AE1040,,,,,,,,,,,,,0,,,,,AB,terrains a bâtir,,,986,,
2019-581649,2019-09-18,000001,Vente,154000,,,BAILLET,B003,38570,38181,Goncelin,38,,,38181000AE1045,,,,,,,,,,,,,0,,,,,T,terres,,,48,5.979714,45.338276
2019-581649,2019-09-18,000001,Vente,154000,,,BAILLET,B003,38570,38181,Goncelin,38,,,38181000AE1046,,,,,,,,,,,,,0,,,,,T,terres,,,351,5.979528,45.338746
2019-581649,2019-09-18,000001,Vente,154000,,,BAILLET,B003,38570,38181,Goncelin,38,,,38181000AE1047,,,,,,,,,,,,,0,,,,,T,terres,,,1710,5.979881,45.339054