id_mutation,date_mutation,numero_disposition,nature_mutation,valeur_fonciere,adresse_numero,adresse_suffixe,adresse_nom_voie,adresse_code_voie,code_postal,code_commune,nom_commune,code_departement,ancien_code_commune,ancien_nom_commune,id_parcelle,ancien_id_parcelle,numero_volume,lot1_numero,lot1_surface_carrez,lot2_numero,lot2_surface_carrez,lot3_numero,lot3_surface_carrez,lot4_numero,lot4_surface_carrez,lot5_numero,lot5_surface_carrez,nombre_lots,code_type_local,type_local,surface_reelle_bati,nombre_pieces_principales,code_nature_culture,nature_culture,code_nature_culture_speciale,nature_culture_speciale,surface_terrain,longitude,latitude
2019-599281,2019-01-30,000001,Vente,184500,15,,RUE DE FONNAT,0060,38270,38219,Marcollin,38,,,38219000ZK0040,,,,,,,,,,,,,0,1,Maison,90,4,S,sols,,,700,5.083815,45.303955
2019-599431,2019-02-28,000001,Vente,3500,,,LES MATHS,B036,38270,38219,Marcollin,38,,,38219000AI0162,,,,,,,,,,,,,0,,,,,BT,taillis simples,,,2032,5.118372,45.306836
2019-599431,2019-02-28,000001,Vente,3500,,,LES MATHS,B036,38270,38219,Marcollin,38,,,38219000AI0162,,,,,,,,,,,,,0,,,,,BT,taillis simples,,,2032,5.118372,45.306836
2019-599502,2019-03-08,000001,Vente,305000,,,FANTINIERE,B021,38270,38219,Marcollin,38,,,38219000AL0085,,,,,,,,,,,,,0,,,,,P,prés,,,1200,5.096746,45.304955
2019-599502,2019-03-08,000001,Vente,305000,151,,CHE DE LA FANTINIERE,0055,38270,38219,Marcollin,38,,,38219000AL0086,,,,,,,,,,,,,0,1,Maison,210,5,S,sols,,,2710,5.096613,45.30525
2019-599502,2019-03-08,000001,Vente,305000,,,FANTINIERE,B021,38270,38219,Marcollin,38,,,38219000AL0087,,,,,,,,,,,,,0,,,,,J,jardins,POTAG,Jardin potager,748,5.097476,45.305219
2019-599502,2019-03-08,000001,Vente,305000,,,FANTINIERE,B021,38270,38219,Marcollin,38,,,38219000AL0093,,,,,,,,,,,,,0,,,,,P,prés,,,4340,5.096165,45.305558
2019-599502,2019-03-08,000001,Vente,305000,,,FANTINIERE,B021,38270,38219,Marcollin,38,,,38219000AL0213,,,,,,,,,,,,,0,,,,,T,terres,,,1141,5.096787,45.305545
2019-599502,2019-03-08,000001,Vente,305000,,,FANTINIERE,B021,38270,38219,Marcollin,38,,,38219000AL0216,,,,,,,,,,,,,0,,,,,J,jardins,POTAG,Jardin potager,467,5.097359,45.305312
2019-599659,2019-04-01,000001,Vente,190000,6025,,RTE DE BEAUFORT,0020,38270,38219,Marcollin,38,,,38219000ZH0103,,,,,,,,,,,,,0,1,Maison,113,5,P,prés,,,500,5.114795,45.310212
2019-599659,2019-04-01,000001,Vente,190000,6025,,RTE DE BEAUFORT,0020,38270,38219,Marcollin,38,,,38219000ZH0103,,,,,,,,,,,,,0,1,Maison,113,5,S,sols,,,1000,5.114795,45.310212
2019-599833,2019-05-03,000001,Vente,170000,,,LES PRES DU BOURG,B043,38270,38219,Marcollin,38,,,38219000AM0074,,,,,,,,,,,,,0,,,,,T,terres,,,1193,5.087178,45.30274
2019-599833,2019-05-03,000001,Vente,170000,331,,RTE DE LENTIOL,0114,38270,38219,Marcollin,38,,,38219000AM0075,,,,,,,,,,,,,0,1,Maison,92,4,S,sols,,,543,5.086982,45.302555
2019-599833,2019-05-03,000001,Vente,170000,,,LES PRES DU BOURG,B043,38270,38219,Marcollin,38,,,38219000AM0076,,,,,,,,,,,,,0,,,,,J,jardins,POTAG,Jardin potager,406,5.086849,45.302772
2019-600063,2019-06-14,000001,Vente,300,,,COMBES BESSONNES,B016,38270,38219,Marcollin,38,,,38219000AK0136,,,,,,,,,,,,,0,,,,,BT,taillis simples,,,2159,5.104274,45.302178
2019-600169,2019-07-09,000001,Vente,2728.2,,,COTE MANIN,B018,38270,38219,Marcollin,38,,,38219000ZB0047,,,,,,,,,,,,,0,,,,,T,terres,,,9094,5.079683,45.308409
2019-600201,2019-07-02,000001,Vente,175000,13,,RUE DE FONNAT,0060,38270,38219,Marcollin,38,,,38219000ZK0038,,,,,,,,,,,,,0,1,Maison,101,5,S,sols,,,681,5.084494,45.303956
2019-600453,2019-08-08,000001,Vente,136000,,,LA CHARRIERE,B008,38270,38219,Marcollin,38,,,38219000AL0005,,,,,,,,,,,,,0,,,,,P,prés,,,379,5.087476,45.305737
2019-600453,2019-08-08,000001,Vente,136000,235,,RUE DU FROMENTAL,0062,38270,38219,Marcollin,38,,,38219000AL0006,,,,,,,,,,,,,0,1,Maison,76,3,S,sols,,,1266,5.087347,45.306092
2019-600453,2019-08-08,000001,Vente,136000,,,LA CHARRIERE,B008,38270,38219,Marcollin,38,,,38219000AL0007,,,,,,,,,,,,,0,,,,,J,jardins,POTAG,Jardin potager,253,5.087561,45.305979
2019-600517,2019-09-03,000001,Vente,222020,208,,RUE DE FONNAT,0060,38270,38219,Marcollin,38,,,38219000AM0159,,,,,,,,,,,,,0,1,Maison,150,5,S,sols,,,987,5.081626,45.303193
2019-600517,2019-09-03,000001,Vente,222020,,,BERLIOZ,B002,38270,38219,Marcollin,38,,,38219000AM0208,,,,,,,,,,,,,0,3,Dépendance,,0,S,sols,,,261,5.081656,45.30353
2019-600517,2019-09-03,000001,Vente,222020,,,BERLIOZ,B002,38270,38219,Marcollin,38,,,38219000AM0208,,,,,,,,,,,,,0,3,Dépendance,,0,P,prés,,,1395,5.081656,45.30353
2019-600547,2019-09-06,000001,Vente,162920,37,Q,RUE DE FONNAT,0060,38270,38219,Marcollin,38,,,38219000ZK0042,,,,,,,,,,,,,0,1,Maison,113,5,S,sols,,,700,5.083117,45.304011
2019-600942,2019-03-12,000001,Adjudication,67000,109,,RTE DE VIRIVILLE,0218,38270,38219,Marcollin,38,,,38219000AL0010,,,,,,,,,,,,,0,1,Maison,90,4,S,sols,,,340,5.088226,45.305409
2019-600942,2019-03-12,000001,Adjudication,67000,,,LA CHARRIERE,B008,38270,38219,Marcollin,38,,,38219000AL0011,,,,,,,,,,,,,0,,,,,P,prés,,,80,5.088173,45.305519
2019-601016,2019-11-07,000001,Vente,3000,,,BRAMMES TOURTES,B003,38270,38219,Marcollin,38,,,38219000ZB0006,,,,,,,,,,,,,0,,,,,T,terres,,,7076,5.068019,45.314609
2019-601238,2019-12-20,000001,Vente,190800,1303,,RTE DE LENS LESTANG,0112,38270,38219,Marcollin,38,,,38219000ZA0052,,,,,,,,,,,,,0,1,Maison,95,4,S,sols,,,1312,5.070706,45.303558
2019-601238,2019-12-20,000001,Vente,190800,1303,,RTE DE LENS LESTANG,0112,38270,38219,Marcollin,38,,,38219000ZA0052,,,,,,,,,,,,,0,1,Maison,95,4,P,prés,,,728,5.070706,45.303558
2019-601331,2019-12-30,000001,Vente,70000,,,LA JOUDIERE,B034,38270,38219,Marcollin,38,,,38219000AN0006,,,,,,,,,,,,,0,,,,,S,sols,,,1449,5.066801,45.301771
2019-601331,2019-12-30,000001,Vente,70000,1645,,RTE DE LENS LESTANG,0112,38270,38219,Marcollin,38,,,38219000AN0366,,,,,,,,,,,,,0,1,Maison,84,5,S,sols,,,787,5.066609,45.302126
2019-601331,2019-12-30,000001,Vente,70000,1645,,RTE DE LENS LESTANG,0112,38270,38219,Marcollin,38,,,38219000AN0366,,,,,,,,,,,,,0,1,Maison,84,5,P,prés,,,518,5.066609,45.302126
