id_mutation,date_mutation,numero_disposition,nature_mutation,valeur_fonciere,adresse_numero,adresse_suffixe,adresse_nom_voie,adresse_code_voie,code_postal,code_commune,nom_commune,code_departement,ancien_code_commune,ancien_nom_commune,id_parcelle,ancien_id_parcelle,numero_volume,lot1_numero,lot1_surface_carrez,lot2_numero,lot2_surface_carrez,lot3_numero,lot3_surface_carrez,lot4_numero,lot4_surface_carrez,lot5_numero,lot5_surface_carrez,nombre_lots,code_type_local,type_local,surface_reelle_bati,nombre_pieces_principales,code_nature_culture,nature_culture,code_nature_culture_speciale,nature_culture_speciale,surface_terrain,longitude,latitude
2019-599240,2019-01-31,000001,Vente,234730,25,,RUE DE LA CHARRIERE,0170,38210,38338,La Rivière,38,,,383380000A0726,,,,,,,,,,,,,0,1,Maison,135,4,S,sols,,,284,5.507925,45.23718
2019-599240,2019-01-31,000001,Vente,234730,,,LE CHAMP DU PORT,B011,38210,38338,La Rivière,38,,,383380000A0728,,,,,,,,,,,,,0,,,,,VE,vergers,NOYER,Noyeraie ou noyers,161,5.507802,45.237165
2019-599360,2019-02-08,000001,Vente,87413,6039,,LE BAS LIGNET,B003,38210,38338,La Rivière,38,,,383380000D0382,,,,,,,,,,,,,0,1,Maison,123,5,S,sols,,,1011,5.498047,45.220067
2019-599360,2019-02-08,000001,Vente,87413,,,LE BAS LIGNET,B003,38210,38338,La Rivière,38,,,383380000D0385,,,,,,,,,,,,,0,,,,,S,sols,,,266,5.498251,45.219854
2019-600152,2019-06-12,000001,Vente,260000,5128,,IMP DE CHAMP LONG,0135,38210,38338,La Rivière,38,,,383380000B0683,,,,,,,,,,,,,0,1,Maison,111,5,S,sols,,,1410,5.502091,45.232175
2019-600155,2019-07-03,000001,Vente,130000,,,LE PLACAGE,B049,38210,38338,La Rivière,38,,,383380000A0512,,,,,,,,,,,,,0,,,,,VE,vergers,NOYER,Noyeraie ou noyers,1568,5.504369,45.239401
2019-600155,2019-07-03,000001,Vente,130000,416,,RUE DE LA CHARRIERE,0170,38210,38338,La Rivière,38,,,383380000A0514,,,,,,,,,,,,,0,1,Maison,140,5,S,sols,,,577,5.504056,45.23924
2019-600155,2019-07-03,000001,Vente,130000,,,LE PLACAGE,B049,38210,38338,La Rivière,38,,,383380000A0515,,,,,,,,,,,,,0,,,,,S,sols,,,28,5.504575,45.2394
2019-600155,2019-07-03,000001,Vente,130000,,,LE PLACAGE,B049,38210,38338,La Rivière,38,,,383380000A0687,,,,,,,,,,,,,0,,,,,P,prés,,,929,5.504405,45.239635
2019-600155,2019-07-03,000001,Vente,130000,,,LE PLACAGE,B049,38210,38338,La Rivière,38,,,383380000A0689,,,,,,,,,,,,,0,,,,,S,sols,,,681,5.503892,45.239284
2019-600224,2019-07-19,000001,Vente,248000,71,,RUE DU CHAMP DE L'ORDRE,0143,38210,38338,La Rivière,38,,,383380000A0732,,,,,,,,,,,,,0,1,Maison,112,5,S,sols,,,636,5.507722,45.238233
2019-600224,2019-07-19,000001,Vente,248000,,,LE CHAMP DE L ORDRE,B010,38210,38338,La Rivière,38,,,383380000A0736,,,,,,,,,,,,,0,,,,,AB,terrains a bâtir,,,177,5.508048,45.238299
2019-600479,2019-09-04,000001,Vente,265000,6001,,LE CHAMP DE L ORDRE,B010,38210,38338,La Rivière,38,,,383380000A0697,,,,,,,,,,,,,0,3,Dépendance,,0,S,sols,,,793,5.507935,45.237907
2019-600479,2019-09-04,000001,Vente,265000,6001,,LE CHAMP DE L ORDRE,B010,38210,38338,La Rivière,38,,,383380000A0697,,,,,,,,,,,,,0,1,Maison,92,5,S,sols,,,793,5.507935,45.237907
2019-600697,2019-10-04,000001,Vente,11145,,,LE CHAMP DU PORT,B011,38210,38338,La Rivière,38,,,383380000C0064,,,,,,,,,,,,,0,,,,,VE,vergers,NOYER,Noyeraie ou noyers,1480,5.486458,45.218982
2019-600697,2019-10-04,000001,Vente,11145,,,LE CHAMP DU PORT,B011,38210,38338,La Rivière,38,,,383380000C0064,,,,,,,,,,,,,0,,,,,VE,vergers,NOYER,Noyeraie ou noyers,1480,5.486458,45.218982
2019-600697,2019-10-04,000001,Vente,11145,,,LE PRE NOVIN,B052,38210,38338,La Rivière,38,,,383380000C0236,,,,,,,,,,,,,0,,,,,VE,vergers,NOYER,Noyeraie ou noyers,600,5.492651,45.218479
2019-600697,2019-10-04,000001,Vente,11145,,,LE PRE NOVIN,B052,38210,38338,La Rivière,38,,,383380000C0236,,,,,,,,,,,,,0,,,,,TP,terres plantées,,,730,5.492651,45.218479
2019-600697,2019-10-04,000001,Vente,11145,,,LE PRE NOVIN,B052,38210,38338,La Rivière,38,,,383380000C0237,,,,,,,,,,,,,0,,,,,VE,vergers,NOYER,Noyeraie ou noyers,1250,5.492922,45.218714
2019-600914,2019-10-14,000002,Vente,219500,160,,RUE DU BARON,0080,38210,38338,La Rivière,38,,,383380000B0101,,,,,,,,,,,,,0,1,Maison,100,3,S,sols,,,665,5.507278,45.235936
2019-600956,2019-11-12,000001,Vente,226400,17,,BRIQUETIERE,B007,38210,38338,La Rivière,38,,,383380000B1054,,,,,,,,,,,,,0,1,Maison,98,5,S,sols,,,336,5.505883,45.234848
2019-601002,2019-11-21,000001,Vente,148000,5075,,MICANDIERE,B043,38210,38338,La Rivière,38,,,383380000B0391,,,,,,,,,,,,,0,3,Dépendance,,0,S,sols,,,500,5.496904,45.229627
2019-601002,2019-11-21,000001,Vente,148000,5075,,MICANDIERE,B043,38210,38338,La Rivière,38,,,383380000B0391,,,,,,,,,,,,,0,1,Maison,120,4,S,sols,,,500,5.496904,45.229627
2019-601002,2019-11-21,000001,Vente,148000,,,MICANDIERE,B043,38210,38338,La Rivière,38,,,383380000B0392,,,,,,,,,,,,,0,,,,,S,sols,,,380,5.496722,45.229797
2019-601002,2019-11-21,000001,Vente,148000,,,MICANDIERE,B043,38210,38338,La Rivière,38,,,383380000B0392,,,,,,,,,,,,,0,,,,,P,prés,,,2075,5.496722,45.229797
2019-601002,2019-11-21,000001,Vente,148000,,,MICANDIERE,B043,38210,38338,La Rivière,38,,,383380000B0392,,,,,,,,,,,,,0,,,,,T,terres,,,2000,5.496722,45.229797
2019-601061,2019-11-14,000001,Vente,72000,5006,,LE CHAMP DU PORT,B011,38210,38338,La Rivière,38,,,383380000A0131,,,,,,,,,,,,,0,1,Maison,100,4,S,sols,,,145,5.50759,45.237347
2019-601061,2019-11-14,000001,Vente,72000,,,LE CHAMP DU PORT,B011,38210,38338,La Rivière,38,,,383380000A0769,,,,,,,,,,,,,0,,,,,S,sols,,,256,5.507487,45.237177
2019-601175,2019-12-04,000001,Vente,64000,5044,,PONTONNIERE,B051,38210,38338,La Rivière,38,,,383380000B0056,,,,,,,,,,,,,0,2,Appartement,70,3,S,sols,,,160,5.50757,45.23624
2019-601175,2019-12-04,000001,Vente,64000,5044,,PONTONNIERE,B051,38210,38338,La Rivière,38,,,383380000B0056,,,,,,,,,,,,,0,2,Appartement,70,3,S,sols,,,160,5.50757,45.23624
2019-601257,2019-12-26,000001,Vente,204350,,,LE MOLLARD,B044,38210,38338,La Rivière,38,,,383380000B0140,,,,,,,,,,,,,0,,,,,S,sols,,,30,5.503022,45.232857
2019-601257,2019-12-26,000001,Vente,204350,,,LE MOLLARD,B044,38210,38338,La Rivière,38,,,383380000B0692,,,,,,,,,,,,,0,1,Maison,110,4,S,sols,,,92,5.503039,45.232912
2019-601257,2019-12-26,000001,Vente,204350,,,LE MOLLARD,B044,38210,38338,La Rivière,38,,,383380000B0932,,,,,,,,,,,,,0,,,,,S,sols,,,93,5.502921,45.233002
2019-601257,2019-12-26,000001,Vente,204350,,,LE MOLLARD,B044,38210,38338,La Rivière,38,,,383380000B0935,,,,,,,,,,,,,0,,,,,S,sols,,,160,5.50302,45.232955
2019-601306,2019-12-18,000001,Vente,228110,27,,BRIQUETIERE,B007,38210,38338,La Rivière,38,,,383380000B1056,,,,,,,,,,,,,0,1,Maison,98,5,S,sols,,,335,5.50552,45.234949
