id_mutation,date_mutation,numero_disposition,nature_mutation,valeur_fonciere,adresse_numero,adresse_suffixe,adresse_nom_voie,adresse_code_voie,code_postal,code_commune,nom_commune,code_departement,ancien_code_commune,ancien_nom_commune,id_parcelle,ancien_id_parcelle,numero_volume,lot1_numero,lot1_surface_carrez,lot2_numero,lot2_surface_carrez,lot3_numero,lot3_surface_carrez,lot4_numero,lot4_surface_carrez,lot5_numero,lot5_surface_carrez,nombre_lots,code_type_local,type_local,surface_reelle_bati,nombre_pieces_principales,code_nature_culture,nature_culture,code_nature_culture_speciale,nature_culture_speciale,surface_terrain,longitude,latitude
2019-602039,2019-02-15,000001,Vente,50000,,,AU VILLAGE,B086,39110,39006,Aiglepierre,39,,,39006000AB0145,,,,,,,,,,,,,0,,,,,S,sols,,,567,5.818189,46.952473
2019-606715,2019-10-28,000001,Vente,272420,33,,RUE DES ORCIERES,0009,39110,39006,Aiglepierre,39,,,39006000ZC0012,,,,,,,,,,,,,0,1,Maison,136,5,S,sols,,,1000,5.815389,46.955353
2019-606715,2019-10-28,000001,Vente,272420,33,,RUE DES ORCIERES,0009,39110,39006,Aiglepierre,39,,,39006000ZC0012,,,,,,,,,,,,,0,1,Maison,136,5,P,prés,,,1270,5.815389,46.955353
2019-607511,2019-12-10,000001,Vente,70000,5104,,AU BELU,B003,39110,39006,Aiglepierre,39,,,390060000A0540,,,,,,,,,,,,,0,4,Local industriel. commercial ou assimilé,,,S,sols,,,225,5.799242,46.957606
2019-608250,2019-04-01,000001,Adjudication,32000,,,AU VILLAGE,B086,39110,39006,Aiglepierre,39,,,39006000AB0118,,,,,,,,,,,,,0,,,,,J,jardins,,,186,5.817698,46.953006
2019-608250,2019-04-01,000001,Adjudication,32000,13,,RUE DES ORCIERES,0009,39110,39006,Aiglepierre,39,,,39006000AB0129,,,,,,,,,,,,,0,1,Maison,40,1,S,sols,,,128,5.817423,46.952799
2019-608250,2019-04-01,000001,Adjudication,32000,7,,CHE DES LILAS,0008,39110,39006,Aiglepierre,39,,,39006000AB0131,,,,,,,,,,,,,0,4,Local industriel. commercial ou assimilé,48,0,S,sols,,,335,5.817567,46.952778
2019-608250,2019-04-01,000001,Adjudication,32000,7,,CHE DES LILAS,0008,39110,39006,Aiglepierre,39,,,39006000AB0131,,,,,,,,,,,,,0,1,Maison,44,1,S,sols,,,335,5.817567,46.952778
