id_mutation,date_mutation,numero_disposition,nature_mutation,valeur_fonciere,adresse_numero,adresse_suffixe,adresse_nom_voie,adresse_code_voie,code_postal,code_commune,nom_commune,code_departement,ancien_code_commune,ancien_nom_commune,id_parcelle,ancien_id_parcelle,numero_volume,lot1_numero,lot1_surface_carrez,lot2_numero,lot2_surface_carrez,lot3_numero,lot3_surface_carrez,lot4_numero,lot4_surface_carrez,lot5_numero,lot5_surface_carrez,nombre_lots,code_type_local,type_local,surface_reelle_bati,nombre_pieces_principales,code_nature_culture,nature_culture,code_nature_culture_speciale,nature_culture_speciale,surface_terrain,longitude,latitude
2019-601813,2019-02-07,000001,Vente,4935,,,PRES DU MILIEU,B070,39250,39085,Cerniébaud,39,,,39085000ZA0025,,,,,,,,,,,,,0,,,,,BR,futaies résineuses,EPICE,Epicéas,2750,6.110877,46.726804
2019-601813,2019-02-07,000001,Vente,4935,,,PRES DU MILIEU,B070,39250,39085,Cerniébaud,39,,,39085000ZA0026,,,,,,,,,,,,,0,,,,,BF,futaies feuillues,,,2710,6.111376,46.727042
2019-601989,2019-02-09,000001,Vente,22000,,,LES ESSARDS,B043,39250,39085,Cerniébaud,39,,,39085000ZA0018,,,,,,,,,,,,,0,,,,,B,bois,,,762,6.107138,46.72424
2019-601989,2019-02-09,000001,Vente,22000,,,LES ESSARDS,B043,39250,39085,Cerniébaud,39,,,39085000ZA0018,,,,,,,,,,,,,0,,,,,BR,futaies résineuses,EPICE,Epicéas,1152,6.107138,46.72424
2019-601989,2019-02-09,000001,Vente,22000,,,LES ESSARDS,B043,39250,39085,Cerniébaud,39,,,39085000ZA0018,,,,,,,,,,,,,0,,,,,B,bois,,,1728,6.107138,46.72424
2019-601989,2019-02-09,000001,Vente,22000,,,LES ESSARDS,B043,39250,39085,Cerniébaud,39,,,39085000ZA0018,,,,,,,,,,,,,0,,,,,BF,futaies feuillues,,,508,6.107138,46.72424
2019-601989,2019-02-09,000001,Vente,22000,,,LES ESSARDS,B043,39250,39085,Cerniébaud,39,,,39085000ZA0020,,,,,,,,,,,,,0,,,,,BR,futaies résineuses,EPICE,Epicéas,996,6.108054,46.725676
2019-601989,2019-02-09,000001,Vente,22000,,,LES ESSARDS,B043,39250,39085,Cerniébaud,39,,,39085000ZA0020,,,,,,,,,,,,,0,,,,,B,bois,,,3367,6.108054,46.725676
2019-601989,2019-02-09,000001,Vente,22000,,,LES ESSARDS,B043,39250,39085,Cerniébaud,39,,,39085000ZA0020,,,,,,,,,,,,,0,,,,,P,prés,,,3640,6.108054,46.725676
2019-601989,2019-02-09,000001,Vente,22000,,,LES ESSARDS,B043,39250,39085,Cerniébaud,39,,,39085000ZA0020,,,,,,,,,,,,,0,,,,,BR,futaies résineuses,EPICE,Epicéas,255,6.108054,46.725676
2019-601989,2019-02-09,000001,Vente,22000,,,LES ESSARDS,B043,39250,39085,Cerniébaud,39,,,39085000ZA0020,,,,,,,,,,,,,0,,,,,B,bois,,,595,6.108054,46.725676
2019-601989,2019-02-09,000001,Vente,22000,,,LES ESSARDS,B043,39250,39085,Cerniébaud,39,,,39085000ZA0020,,,,,,,,,,,,,0,,,,,BR,futaies résineuses,EPICE,Epicéas,1443,6.108054,46.725676
2019-601989,2019-02-09,000001,Vente,22000,,,LES ESSARDS,B043,39250,39085,Cerniébaud,39,,,39085000ZA0020,,,,,,,,,,,,,0,,,,,B,bois,,,1792,6.108054,46.725676
2019-601989,2019-02-09,000001,Vente,22000,,,LES ESSARDS,B043,39250,39085,Cerniébaud,39,,,39085000ZA0020,,,,,,,,,,,,,0,,,,,BR,futaies résineuses,EPICE,Epicéas,768,6.108054,46.725676
2019-601989,2019-02-09,000001,Vente,22000,,,LES ESSARDS,B043,39250,39085,Cerniébaud,39,,,39085000ZA0020,,,,,,,,,,,,,0,,,,,B,bois,,,2324,6.108054,46.725676
2019-603518,2019-05-04,000001,Vente,500,,,LA VERNOGE,B079,39250,39085,Cerniébaud,39,,,39085000ZD0064,,,,,,,,,,,,,0,,,,,BF,futaies feuillues,,,3330,6.123565,46.729688
2019-603518,2019-05-04,000001,Vente,500,,,LA VERNOGE,B079,39250,39085,Cerniébaud,39,,,39085000ZD0065,,,,,,,,,,,,,0,,,,,BR,futaies résineuses,EPICE,Epicéas,4720,6.123297,46.729946
2019-604168,2019-06-17,000001,Vente,35000,,,SUR LE GRAND CHAMP,B046,39250,39085,Cerniébaud,39,,,390850000A0213,,,,,,,,,,,,,0,,,,,BR,futaies résineuses,EPICE,Epicéas,28430,6.11924,46.754799
2019-604168,2019-06-17,000001,Vente,35000,,,SUR LE GRAND CHAMP,B046,39250,39085,Cerniébaud,39,,,390850000A0213,,,,,,,,,,,,,0,,,,,BR,futaies résineuses,EPICE,Epicéas,1945,6.11924,46.754799
2019-604422,2019-06-13,000001,Vente,7000,,,LA GRANGETTE,B082,39250,39085,Cerniébaud,39,,,39085000ZC0048,,,,,,,,,,,,,0,,,,,T,terres,,,2440,6.129785,46.750971
2019-604422,2019-06-13,000001,Vente,7000,,,LA GRANGETTE,B082,39250,39085,Cerniébaud,39,,,39085000ZC0048,,,,,,,,,,,,,0,,,,,BR,futaies résineuses,EPICE,Epicéas,7510,6.129785,46.750971
2019-606744,2019-10-22,000001,Vente,130000,5051,,COMBE SIMON,B038,39250,39085,Cerniébaud,39,,,39085000ZA0070,,,,,,,,,,,,,0,1,Maison,73,5,S,sols,,,1090,6.116837,46.733021
