id_mutation,date_mutation,numero_disposition,nature_mutation,valeur_fonciere,adresse_numero,adresse_suffixe,adresse_nom_voie,adresse_code_voie,code_postal,code_commune,nom_commune,code_departement,ancien_code_commune,ancien_nom_commune,id_parcelle,ancien_id_parcelle,numero_volume,lot1_numero,lot1_surface_carrez,lot2_numero,lot2_surface_carrez,lot3_numero,lot3_surface_carrez,lot4_numero,lot4_surface_carrez,lot5_numero,lot5_surface_carrez,nombre_lots,code_type_local,type_local,surface_reelle_bati,nombre_pieces_principales,code_nature_culture,nature_culture,code_nature_culture_speciale,nature_culture_speciale,surface_terrain,longitude,latitude
2019-601842,2019-01-30,000001,Vente,10000,,,AU VILLAGE,B035,39250,39282,La Latette,39,,,39282000AA0010,,,,,,,,,,,,,0,,,,,S,sols,,,355,6.089702,46.752147
2019-602801,2019-04-08,000001,Vente,230000,2,,COMBE BOURNY,B012,39250,39282,La Latette,39,,,39282000ZE0044,,,,,,,,,,,,,0,1,Maison,93,4,AG,terrains d'agrément,,,301,6.092891,46.754737
2019-602801,2019-04-08,000001,Vente,230000,2,,COMBE BOURNY,B012,39250,39282,La Latette,39,,,39282000ZE0044,,,,,,,,,,,,,0,1,Maison,93,4,S,sols,,,1000,6.092891,46.754737
2019-604483,2019-07-02,000001,Vente,500,,,PRES SUR CENDREY,B033,39250,39282,La Latette,39,,,39282000ZD0002,,,,,,,,,,,,,0,,,,,BR,futaies résineuses,,,5665,6.115729,46.752684
2019-604483,2019-07-02,000001,Vente,500,,,PRES SUR CENDREY,B033,39250,39282,La Latette,39,,,39282000ZD0003,,,,,,,,,,,,,0,,,,,BR,futaies résineuses,,,1620,6.117048,46.752148
2019-606673,2019-10-18,000001,Echange,6000,,,A LA GRANDE RAYE,B019,39250,39282,La Latette,39,,,39282000ZB0045,,,,,,,,,,,,,0,,,,,T,terres,,,15107,6.080288,46.759897
2019-606673,2019-10-18,000001,Echange,6000,,,A LA GRANDE RAYE,B019,39250,39282,La Latette,39,,,39282000ZB0045,,,,,,,,,,,,,0,,,,,T,terres,,,15108,6.080288,46.759897
2019-606673,2019-10-18,000002,Echange,6000,,,CHAMPS FRICHARD,B006,39250,39282,La Latette,39,,,39282000ZB0021,,,,,,,,,,,,,0,,,,,T,terres,,,23340,6.092565,46.756454
