id_mutation,date_mutation,numero_disposition,nature_mutation,valeur_fonciere,adresse_numero,adresse_suffixe,adresse_nom_voie,adresse_code_voie,code_postal,code_commune,nom_commune,code_departement,ancien_code_commune,ancien_nom_commune,id_parcelle,ancien_id_parcelle,numero_volume,lot1_numero,lot1_surface_carrez,lot2_numero,lot2_surface_carrez,lot3_numero,lot3_surface_carrez,lot4_numero,lot4_surface_carrez,lot5_numero,lot5_surface_carrez,nombre_lots,code_type_local,type_local,surface_reelle_bati,nombre_pieces_principales,code_nature_culture,nature_culture,code_nature_culture_speciale,nature_culture_speciale,surface_terrain,longitude,latitude
2019-608296,2019-01-09,000001,Vente,121200,18,,RUE JULES FERRY,0700,40270,40117,Grenade-sur-l'Adour,40,,,401170000J1416,,,,,,,,,,,,,0,1,Maison,88,3,S,sols,,,1002,-0.429873,43.776719
2019-608298,2019-01-09,000001,Vente,91000,4,,RUE MONSEIGNEUR CASSAIGNE,0860,40270,40117,Grenade-sur-l'Adour,40,,,401170000K0263,,,,,,,,,,,,,0,1,Maison,95,4,S,sols,,,97,-0.429231,43.772788
2019-608301,2019-01-09,000001,Vente,114310,2,,RUE DU SOLEIL,1140,40270,40117,Grenade-sur-l'Adour,40,,,401170000K0571,,,,,,,,,,,,,0,2,Appartement,102,4,S,sols,,,70,-0.429529,43.772905
2019-608314,2019-01-11,000001,Vente,138000,14,,AV FRANCOIS BROUSSE,0593,40270,40117,Grenade-sur-l'Adour,40,,,401170000J1179,,,,,,,,,,,,,0,1,Maison,91,4,S,sols,,,769,-0.430836,43.782833
2019-608518,2019-01-16,000001,Vente,117690,,,CALUCHET,B022,40270,40117,Grenade-sur-l'Adour,40,,,401170000F0091,,,,,,,,,,,,,0,,,,,T,terres,,,21966,-0.398058,43.790764
2019-608518,2019-01-16,000001,Vente,117690,,,CALUCHET,B022,40270,40117,Grenade-sur-l'Adour,40,,,401170000F0092,,,,,,,,,,,,,0,,,,,T,terres,,,19353,-0.400073,43.791052
2019-608518,2019-01-16,000001,Vente,117690,,,CALUCHET,B022,40270,40117,Grenade-sur-l'Adour,40,,,401170000F0093,,,,,,,,,,,,,0,,,,,T,terres,,,4370,-0.400882,43.791763
2019-608518,2019-01-16,000001,Vente,117690,,,POUNTET,B091,40270,40117,Grenade-sur-l'Adour,40,,,401170000F0170,,,,,,,,,,,,,0,,,,,T,terres,,,16420,-0.400971,43.789943
2019-608518,2019-01-16,000001,Vente,117690,,,POUNTET,B091,40270,40117,Grenade-sur-l'Adour,40,,,401170000F0171,,,,,,,,,,,,,0,,,,,T,terres,,,8990,-0.399562,43.78978
2019-608518,2019-01-16,000001,Vente,117690,,,POUNTET,B091,40270,40117,Grenade-sur-l'Adour,40,,,401170000F0172,,,,,,,,,,,,,0,,,,,T,terres,,,4410,-0.398451,43.789742
2019-608518,2019-01-16,000001,Vente,117690,,,POUNTET,B091,40270,40117,Grenade-sur-l'Adour,40,,,401170000F0185,,,,,,,,,,,,,0,,,,,T,terres,,,26545,-0.399947,43.788918
2019-608518,2019-01-16,000001,Vente,117690,,,POUNTET,B091,40270,40117,Grenade-sur-l'Adour,40,,,401170000F0317,,,,,,,,,,,,,0,,,,,T,terres,,,262,-0.399091,43.78952
2019-608527,2019-01-16,000001,Vente,526500,,,CALUCHET,B022,40270,40117,Grenade-sur-l'Adour,40,,,401170000F0094,,,,,,,,,,,,,0,,,,,T,terres,,,4980,-0.401471,43.792104
2019-608527,2019-01-16,000001,Vente,526500,,,CALUCHET,B022,40270,40117,Grenade-sur-l'Adour,40,,,401170000F0095,,,,,,,,,,,,,0,,,,,P,prés,,,6690,-0.402428,43.792581
2019-608527,2019-01-16,000001,Vente,526500,,,CALUCHET,B022,40270,40117,Grenade-sur-l'Adour,40,,,401170000F0111,,,,,,,,,,,,,0,,,,,T,terres,,,3005,,
2019-608527,2019-01-16,000001,Vente,526500,,,CALUCHET,B022,40270,40117,Grenade-sur-l'Adour,40,,,401170000F0114,,,,,,,,,,,,,0,,,,,T,terres,,,7719,-0.404736,43.792314
2019-608527,2019-01-16,000001,Vente,526500,,,CALUCHET,B022,40270,40117,Grenade-sur-l'Adour,40,,,401170000F0115,,,,,,,,,,,,,0,,,,,T,terres,,,2579,-0.40391,43.792673
2019-608527,2019-01-16,000001,Vente,526500,,,CALUCHET,B022,40270,40117,Grenade-sur-l'Adour,40,,,401170000F0116,,,,,,,,,,,,,0,,,,,T,terres,,,4857,-0.405649,43.792355
2019-608527,2019-01-16,000001,Vente,526500,,,CALUCHET,B022,40270,40117,Grenade-sur-l'Adour,40,,,401170000F0117,,,,,,,,,,,,,0,,,,,T,terres,,,5913,-0.405534,43.792856
2019-608527,2019-01-16,000001,Vente,526500,,,POUNTET,B091,40270,40117,Grenade-sur-l'Adour,40,,,401170000F0342,,,,,,,,,,,,,0,,,,,T,terres,,,35039,-0.404913,43.789825
2019-608527,2019-01-16,000001,Vente,526500,,,POUNTET,B091,40270,40117,Grenade-sur-l'Adour,40,,,401170000F0344,,,,,,,,,,,,,0,,,,,T,terres,,,35477,-0.402982,43.789133
2019-608527,2019-01-16,000001,Vente,526500,,,POUNTET,B091,40270,40117,Grenade-sur-l'Adour,40,,,401170000F0346,,,,,,,,,,,,,0,,,,,T,terres,,,5883,-0.402536,43.790384
2019-608527,2019-01-16,000001,Vente,526500,,,CALUCHET,B022,40270,40117,Grenade-sur-l'Adour,40,,,401170000F0348,,,,,,,,,,,,,0,,,,,T,terres,,,35595,-0.402376,43.791333
2019-608527,2019-01-16,000001,Vente,526500,,,CALUCHET,B022,40270,40117,Grenade-sur-l'Adour,40,,,401170000F0350,,,,,,,,,,,,,0,,,,,T,terres,,,4739,-0.405017,43.790954
2019-608527,2019-01-16,000001,Vente,526500,,,CALUCHET,B022,40270,40117,Grenade-sur-l'Adour,40,,,401170000F0352,,,,,,,,,,,,,0,,,,,T,terres,,,12365,,
2019-608687,2019-01-25,000001,Vente,10000,1,,RUE TRAVERSIERE,1160,40270,40117,Grenade-sur-l'Adour,40,,,401170000K0417,,,,,,,,,,,,,0,3,Dépendance,,0,S,sols,,,56,-0.427496,43.772375
2019-608790,2019-02-15,000001,Vente,183000,14,,RUE BELLEVUE,0310,40270,40117,Grenade-sur-l'Adour,40,,,401170000H0346,,,,,,,,,,,,,0,1,Maison,88,4,S,sols,,,629,-0.425279,43.778531
2019-608929,2019-02-28,000001,Vente,60000,5,,RUE CONDOM,0520,40270,40117,Grenade-sur-l'Adour,40,,,401170000K0233,,,,,,,,,,,,,0,1,Maison,75,5,S,sols,,,240,-0.427357,43.772271
2019-609371,2019-02-22,000001,Vente,165000,1517,,CHE DE CALUCHET,0390,40270,40117,Grenade-sur-l'Adour,40,,,401170000F0363,,,,,,,,,,,,,0,1,Maison,240,7,J,jardins,,,902,-0.407016,43.785892
2019-609371,2019-02-22,000001,Vente,165000,1517,,CHE DE CALUCHET,0390,40270,40117,Grenade-sur-l'Adour,40,,,401170000F0363,,,,,,,,,,,,,0,1,Maison,240,7,S,sols,,,1055,-0.407016,43.785892
2019-609371,2019-02-22,000001,Vente,165000,1517,,CHE DE CALUCHET,0390,40270,40117,Grenade-sur-l'Adour,40,,,401170000F0363,,,,,,,,,,,,,0,1,Maison,240,7,T,terres,,,13444,-0.407016,43.785892
2019-609371,2019-02-22,000001,Vente,165000,,,RECHEDE,B093,40270,40117,Grenade-sur-l'Adour,40,,,401170000F0371,,,,,,,,,,,,,0,,,,,T,terres,,,12,-0.407831,43.785549
2019-609371,2019-02-22,000001,Vente,165000,,,RECHEDE,B093,40270,40117,Grenade-sur-l'Adour,40,,,401170000F0372,,,,,,,,,,,,,0,,,,,T,terres,,,3229,-0.407249,43.785089
2019-609378,2019-03-01,000001,Vente,1770,,,LABORDE,B056,40270,40117,Grenade-sur-l'Adour,40,,,401170000B0343,,,,,,,,,,,,,0,,,,,L,landes,,,2889,,
2019-609944,2019-03-19,000001,Vente,202000,8,B,RUE DES CAPUCINS,0410,40270,40117,Grenade-sur-l'Adour,40,,,401170000K0325,,,,,,,,,,,,,0,3,Dépendance,,0,AG,terrains d'agrément,,,678,-0.43126,43.772471
2019-609944,2019-03-19,000001,Vente,202000,8,B,RUE DES CAPUCINS,0410,40270,40117,Grenade-sur-l'Adour,40,,,401170000K0325,,,,,,,,,,,,,0,3,Dépendance,,0,S,sols,,,240,-0.43126,43.772471
2019-609944,2019-03-19,000001,Vente,202000,8,,RUE DES CAPUCINS,0410,40270,40117,Grenade-sur-l'Adour,40,,,401170000K0501,,,,,,,,,,,,,0,1,Maison,184,5,S,sols,,,200,-0.43124,43.772581
2019-609944,2019-03-19,000001,Vente,202000,,,LA VILLE,B102,40270,40117,Grenade-sur-l'Adour,40,,,401170000K0503,,,,,,,,,,,,,0,,,,,S,sols,,,84,-0.431039,43.772706
2019-610316,2019-03-15,000001,Vente,95000,2,,RUE BELLEVUE,0310,40270,40117,Grenade-sur-l'Adour,40,,,401170000H0352,,,,,,,,,,,,,0,1,Maison,61,3,S,sols,,,589,-0.425625,43.778942
2019-611060,2019-04-11,000001,Vente,75000,,,MYREDE,B078,40270,40117,Grenade-sur-l'Adour,40,,,401170000A0231,,,,,,,,,,,,,0,,,,,BT,taillis simples,,,10250,-0.454041,43.811683
2019-611066,2019-04-29,000001,Vente,39500,,,MONDEBAT,B075,40270,40117,Grenade-sur-l'Adour,40,,,401170000A0336,,,,,,,,,,,,,0,,,,,AB,terrains a bâtir,,,1510,-0.446702,43.798766
2019-611498,2019-04-24,000001,Vente,32000,,,SAINT-LEZER,B096,40270,40117,Grenade-sur-l'Adour,40,,,401170000G0541,,,,,,,,,,,,,0,,,,,AB,terrains a bâtir,,,801,-0.423481,43.776434
2019-611498,2019-04-24,000001,Vente,32000,,,SAINT-LEZER,B096,40270,40117,Grenade-sur-l'Adour,40,,,401170000G0544,,,,,,,,,,,,,0,,,,,L,landes,,,388,-0.423857,43.776681
2019-611647,2019-04-12,000001,Vente,9290,,,RICAOU,B094,40270,40117,Grenade-sur-l'Adour,40,,,401170000F0194,,,,,,,,,,,,,0,,,,,T,terres,,,14980,-0.40417,43.788214
2019-611820,2019-05-03,000001,Vente,268400,,,LE CHATEAU,B029,40270,40117,Grenade-sur-l'Adour,40,,,401170000J0988,,,,,,,,,,,,,0,,,,,S,sols,,,58,-0.431158,43.774215
2019-611820,2019-05-03,000001,Vente,268400,4,,RUE JULES FERRY,0700,40270,40117,Grenade-sur-l'Adour,40,,,401170000J0990,,,,,,,,,,,,,0,1,Maison,128,4,S,sols,,,598,-0.431301,43.77433
2019-611820,2019-05-03,000001,Vente,268400,,,LE CHATEAU,B029,40270,40117,Grenade-sur-l'Adour,40,,,401170000J0993,,,,,,,,,,,,,0,,,,,AB,terrains a bâtir,,,344,-0.431411,43.774231
2019-612493,2019-05-16,000001,Vente,90000,2,,RUE DES REY D ARTUS,1050,40270,40117,Grenade-sur-l'Adour,40,,,401170000J0679,,,,,,,,,,,,,0,1,Maison,91,4,S,sols,,,615,-0.427973,43.779922
2019-612534,2019-05-21,000001,Vente,173000,4,,RUE DU GENERAL JACQUES SIMON,0595,40270,40117,Grenade-sur-l'Adour,40,,,401170000J1135,,,,,,,,,,,,,0,1,Maison,78,4,S,sols,,,707,-0.428122,43.782674
2019-612569,2019-05-31,000001,Vente,205000,8,,RUE DE BELOT,0320,40270,40117,Grenade-sur-l'Adour,40,,,401170000K0340,,,,,,,,,,,,,0,1,Maison,165,5,S,sols,,,84,-0.431807,43.772544
2019-612569,2019-05-31,000001,Vente,205000,,,LA VILLE,B102,40270,40117,Grenade-sur-l'Adour,40,,,401170000K0341,,,,,,,,,,,,,0,,,,,S,sols,,,179,-0.431908,43.772487
2019-612569,2019-05-31,000001,Vente,205000,,,LA VILLE,B102,40270,40117,Grenade-sur-l'Adour,40,,,401170000K0348,,,,,,,,,,,,,0,,,,,PA,pâtures,PATUR,Pâture plantée,303,-0.432636,43.772145
2019-612569,2019-05-31,000001,Vente,205000,,,LA VILLE,B102,40270,40117,Grenade-sur-l'Adour,40,,,401170000K0349,,,,,,,,,,,,,0,,,,,J,jardins,,,296,-0.432935,43.772165
2019-612569,2019-05-31,000001,Vente,205000,,,LA VILLE,B102,40270,40117,Grenade-sur-l'Adour,40,,,401170000K0407,,,,,,,,,,,,,0,,,,,AG,terrains d'agrément,,,2057,-0.432771,43.772359
2019-612569,2019-05-31,000001,Vente,205000,,,LA VILLE,B102,40270,40117,Grenade-sur-l'Adour,40,,,401170000K0496,,,,,,,,,,,,,0,,,,,J,jardins,,,865,-0.432312,43.772257
2019-612569,2019-05-31,000001,Vente,205000,,,LA VILLE,B102,40270,40117,Grenade-sur-l'Adour,40,,,401170000K0497,,,,,,,,,,,,,0,,,,,J,jardins,,,692,-0.432067,43.772546
2019-612569,2019-05-31,000001,Vente,205000,5000,F,RUE DE BELOT,0320,40270,40117,Grenade-sur-l'Adour,40,,,401170000K0509,,,,,,,,,,,,,0,3,Dépendance,,0,S,sols,,,28,-0.432065,43.772442
2019-612709,2019-06-06,000001,Vente,479981,2,,RUE DE LA FERME,0590,40270,40117,Grenade-sur-l'Adour,40,,,401170000J0660,,,,,,,,,,,,,0,4,Local industriel. commercial ou assimilé,849,0,S,sols,,,6355,-0.435358,43.778361
2019-612823,2019-06-14,000001,Vente,45000,2,,ALL GUYNEMER,0620,40270,40117,Grenade-sur-l'Adour,40,,,401170000J1372,,,40,60.41,,,,,,,,,1,2,Appartement,58,3,,,,,,-0.428564,43.776736
2019-612823,2019-06-14,000001,Vente,45000,2,,ALL GUYNEMER,0620,40270,40117,Grenade-sur-l'Adour,40,,,401170000J1372,,,27,,,,,,,,,,1,3,Dépendance,,0,,,,,,-0.428564,43.776736
2019-612824,2019-06-11,000001,Vente,120000,,,BARRIQUE,B001,40270,40117,Grenade-sur-l'Adour,40,,,401170000C0319,,,,,,,,,,,,,0,,,,,L,landes,,,15,-0.42589,43.793037
2019-612824,2019-06-11,000001,Vente,120000,,,BARRIQUE,B001,40270,40117,Grenade-sur-l'Adour,40,,,401170000C0324,,,,,,,,,,,,,0,,,,,S,sols,,,372,-0.425838,43.79334
2019-612824,2019-06-11,000001,Vente,120000,,,BARRIQUE,B001,40270,40117,Grenade-sur-l'Adour,40,,,401170000C0326,,,,,,,,,,,,,0,,,,,S,sols,,,33,-0.425775,43.793744
2019-612824,2019-06-11,000001,Vente,120000,56,,CHE DE BERDIS,0330,40270,40117,Grenade-sur-l'Adour,40,,,401170000C0330,,,,,,,,,,,,,0,1,Maison,90,5,S,sols,,,2400,-0.425989,43.793579
2019-612824,2019-06-11,000001,Vente,120000,56,,CHE DE BERDIS,0330,40270,40117,Grenade-sur-l'Adour,40,,,401170000C0330,,,,,,,,,,,,,0,1,Maison,90,5,T,terres,,,3129,-0.425989,43.793579
2019-614336,2019-07-15,000001,Vente,158000,3,,AV FRANCOIS BROUSSE,0593,40270,40117,Grenade-sur-l'Adour,40,,,401170000J1192,,,,,,,,,,,,,0,1,Maison,85,4,S,sols,,,753,-0.43178,43.782537
2019-614546,2019-07-19,000001,Vente,256000,17,,RUE JULES FERRY,0700,40270,40117,Grenade-sur-l'Adour,40,,,401170000J0582,,,,,,,,,,,,,0,1,Maison,140,4,AG,terrains d'agrément,,,833,-0.430555,43.776931
2019-614546,2019-07-19,000001,Vente,256000,17,,RUE JULES FERRY,0700,40270,40117,Grenade-sur-l'Adour,40,,,401170000J0582,,,,,,,,,,,,,0,1,Maison,140,4,S,sols,,,855,-0.430555,43.776931
2019-614546,2019-07-19,000001,Vente,256000,,,COUJON,B032,40270,40117,Grenade-sur-l'Adour,40,,,401170000J0656,,,,,,,,,,,,,0,,,,,S,sols,,,609,-0.430839,43.777136
2019-614554,2019-07-15,000001,Vente,95280,6,,RUE DU COLONEL COUILLEAU,0510,40270,40117,Grenade-sur-l'Adour,40,,,401170000J1340,,,,,,,,,,,,,0,1,Maison,79,4,S,sols,,,239,-0.429427,43.777803
2019-614602,2019-07-15,000001,Vente,198000,6,,RUE PIERRE JEAN LAMESON,0991,40270,40117,Grenade-sur-l'Adour,40,,,401170000H0634,,,,,,,,,,,,,0,1,Maison,113,4,S,sols,,,963,-0.425368,43.781529
2019-614631,2019-07-16,000001,Vente,85000,11,,RUE DES CAPUCINS,0410,40270,40117,Grenade-sur-l'Adour,40,,,401170000K0309,,,,,,,,,,,,,0,1,Maison,192,6,S,sols,,,454,-0.430204,43.772697
2019-614631,2019-07-16,000001,Vente,85000,,,LA VILLE,B102,40270,40117,Grenade-sur-l'Adour,40,,,401170000K0410,,,,,,,,,,,,,0,,,,,J,jardins,,,456,-0.430996,43.77238
2019-615309,2019-07-29,000001,Vente,180000,4,,RUE HIPPOLYTE PUYO,0665,40270,40117,Grenade-sur-l'Adour,40,,,401170000J1429,,,,,,,,,,,,,0,1,Maison,95,4,S,sols,,,555,-0.429325,43.783926
2019-615384,2019-08-05,000001,Vente,104,,,LE CHATEAU,B029,40270,40117,Grenade-sur-l'Adour,40,,,401170000J0994,,,,,,,,,,,,,0,,,,,S,sols,,,13,-0.431569,43.773912
2019-615448,2019-08-01,000001,Vente,8000,,,HEOURE,B047,40270,40117,Grenade-sur-l'Adour,40,,,401170000F0024,,,,,,,,,,,,,0,,,,,L,landes,,,19272,-0.397574,43.798398
2019-615476,2019-08-05,000001,Vente,177000,4,,RUE CHARLES DE BORDA,0460,40270,40117,Grenade-sur-l'Adour,40,,,401170000J0858,,,,,,,,,,,,,0,1,Maison,111,4,S,sols,,,865,-0.429227,43.775695
2019-616305,2019-08-29,000001,Vente,90000,11,,RUE DU PARC DES SPORTS,0910,40270,40117,Grenade-sur-l'Adour,40,,,401170000K0364,,,,,,,,,,,,,0,1,Maison,85,5,S,sols,,,1274,-0.434547,43.772101
2019-616985,2019-09-17,000001,Vente,90800,2,,RUE DES FAUVETTES,0580,40270,40117,Grenade-sur-l'Adour,40,,,401170000J0485,,,,,,,,,,,,,0,1,Maison,70,5,S,sols,,,572,-0.431496,43.775445
2019-617754,2019-10-18,000001,Vente,205000,4,,IMP DES GENETS,0599,40270,40117,Grenade-sur-l'Adour,40,,,401170000J1211,,,,,,,,,,,,,0,1,Maison,133,5,S,sols,,,827,-0.43267,43.783581
2019-618188,2019-10-30,000001,Vente,72000,238,,CHE DE SIMOUN,1130,40270,40117,Grenade-sur-l'Adour,40,,,401170000H0189,,,,,,,,,,,,,0,1,Maison,131,4,P,prés,,,1271,-0.424168,43.778697
2019-618188,2019-10-30,000001,Vente,72000,238,,CHE DE SIMOUN,1130,40270,40117,Grenade-sur-l'Adour,40,,,401170000H0189,,,,,,,,,,,,,0,1,Maison,131,4,S,sols,,,1000,-0.424168,43.778697
2019-618212,2019-10-11,000001,Vente,88200,,,BERNATON,B013,40270,40117,Grenade-sur-l'Adour,40,,,401170000B0021,,,,,,,,,,,,,0,,,,,BR,futaies résineuses,PIN,Pins,17243,-0.443786,43.809725
2019-618212,2019-10-11,000001,Vente,88200,,,MATHIOU,B072,40270,40117,Grenade-sur-l'Adour,40,,,401170000B0066,,,,,,,,,,,,,0,,,,,T,terres,,,580,-0.447178,43.800886
2019-618212,2019-10-11,000001,Vente,88200,,,MATHIOU,B072,40270,40117,Grenade-sur-l'Adour,40,,,401170000B0067,,,,,,,,,,,,,0,,,,,J,jardins,,,488,-0.447498,43.800857
2019-618212,2019-10-11,000001,Vente,88200,544,,CHE DE PEBEROT,0930,40270,40117,Grenade-sur-l'Adour,40,,,401170000B0068,,,,,,,,,,,,,0,1,Maison,47,2,S,sols,,,966,-0.447408,43.801026
2019-618212,2019-10-11,000001,Vente,88200,544,,CHE DE PEBEROT,0930,40270,40117,Grenade-sur-l'Adour,40,,,401170000B0068,,,,,,,,,,,,,0,1,Maison,71,3,S,sols,,,966,-0.447408,43.801026
2019-618212,2019-10-11,000001,Vente,88200,,,MATHIOU,B072,40270,40117,Grenade-sur-l'Adour,40,,,401170000B0069,,,,,,,,,,,,,0,,,,,L,landes,,,560,-0.447417,43.801221
2019-618212,2019-10-11,000001,Vente,88200,,,MATHIOU,B072,40270,40117,Grenade-sur-l'Adour,40,,,401170000B0069,,,,,,,,,,,,,0,,,,,S,sols,,,384,-0.447417,43.801221
2019-618304,2019-10-23,000001,Vente,183000,50,,CHE DE BERDIS,0330,40270,40117,Grenade-sur-l'Adour,40,,,401170000C0317,,,,,,,,,,,,,0,1,Maison,107,5,S,sols,,,1500,-0.425423,43.793222
2019-619876,2019-11-19,000001,Vente,50000,,,LE GRAVIER,B042,40270,40117,Grenade-sur-l'Adour,40,,,401170000J0762,,,,,,,,,,,,,0,,,,,J,jardins,,,60,-0.433341,43.7735
2019-619876,2019-11-19,000001,Vente,50000,5,,RUE DU CASSE,0440,40270,40117,Grenade-sur-l'Adour,40,,,401170000K0374,,,,,,,,,,,,,0,1,Maison,50,3,S,sols,,,152,-0.433094,43.773697
2019-619886,2019-11-29,000001,Vente,73000,5,,RUE DU MIRAIL,0850,40270,40117,Grenade-sur-l'Adour,40,,,401170000K0202,,,,,,,,,,,,,0,1,Maison,115,3,S,sols,,,98,-0.427019,43.772389
