id_mutation,date_mutation,numero_disposition,nature_mutation,valeur_fonciere,adresse_numero,adresse_suffixe,adresse_nom_voie,adresse_code_voie,code_postal,code_commune,nom_commune,code_departement,ancien_code_commune,ancien_nom_commune,id_parcelle,ancien_id_parcelle,numero_volume,lot1_numero,lot1_surface_carrez,lot2_numero,lot2_surface_carrez,lot3_numero,lot3_surface_carrez,lot4_numero,lot4_surface_carrez,lot5_numero,lot5_surface_carrez,nombre_lots,code_type_local,type_local,surface_reelle_bati,nombre_pieces_principales,code_nature_culture,nature_culture,code_nature_culture_speciale,nature_culture_speciale,surface_terrain,longitude,latitude
2019-612730,2019-06-03,000001,Vente,59900,,,SOURDAT,B045,40320,40305,Sorbets,40,,,403050000D0731,,,,,,,,,,,,,0,,,,,T,terres,,,5445,-0.335414,43.63486
2019-612730,2019-06-03,000001,Vente,59900,,,SOURDAT,B045,40320,40305,Sorbets,40,,,403050000D0732,,,,,,,,,,,,,0,,,,,T,terres,,,1500,-0.335717,43.634267
2019-612730,2019-06-03,000001,Vente,59900,242,,CHE DU SOURDAT,0260,40320,40305,Sorbets,40,,,403050000D0734,,,,,,,,,,,,,0,1,Maison,110,3,S,sols,,,480,-0.336101,43.634455
2019-612730,2019-06-03,000001,Vente,59900,,,SOURDAT,B045,40320,40305,Sorbets,40,,,403050000D0735,,,,,,,,,,,,,0,,,,,T,terres,,,1126,-0.336129,43.634726
2019-612730,2019-06-03,000001,Vente,59900,,,SOURDAT,B045,40320,40305,Sorbets,40,,,403050000D0736,,,,,,,,,,,,,0,,,,,BT,taillis simples,CHENE,Chênes,2897,-0.335885,43.635336
2019-612730,2019-06-03,000001,Vente,59900,,,SOURDAT,B045,40320,40305,Sorbets,40,,,403050000D0865,,,,,,,,,,,,,0,,,,,T,terres,,,7322,-0.336642,43.634489
2019-616133,2019-08-22,000001,Vente,2000,,,CANTAOUS,B007,40320,40305,Sorbets,40,,,403050000B0265,,,,,,,,,,,,,0,,,,,BT,taillis simples,CHENE,Chênes,4770,-0.321009,43.629228
2019-616293,2019-08-23,000001,Vente,4900,,,LANDES DOU SABATHE,B023,40320,40305,Sorbets,40,,,403050000A0151,,,,,,,,,,,,,0,,,,,L,landes,,,2155,-0.327519,43.654483
2019-616293,2019-08-23,000001,Vente,4900,,,LANDES DOU SABATHE,B023,40320,40305,Sorbets,40,,,403050000A0153,,,,,,,,,,,,,0,,,,,T,terres,,,2369,-0.327204,43.654241
2019-616293,2019-08-23,000001,Vente,4900,,,LANDES DOU SABATHE,B023,40320,40305,Sorbets,40,,,403050000A0154,,,,,,,,,,,,,0,,,,,T,terres,,,2239,-0.327254,43.654083
2019-616293,2019-08-23,000001,Vente,4900,,,LANDES DOU SABATHE,B023,40320,40305,Sorbets,40,,,403050000A0155,,,,,,,,,,,,,0,,,,,T,terres,,,2429,-0.326939,43.654034
2019-616293,2019-08-23,000001,Vente,4900,,,LANDES DOU SABATHE,B023,40320,40305,Sorbets,40,,,403050000A0156,,,,,,,,,,,,,0,,,,,T,terres,,,2473,-0.326989,43.653872
2019-616293,2019-08-23,000001,Vente,4900,,,LANDES DOU SABATHE,B023,40320,40305,Sorbets,40,,,403050000A0157,,,,,,,,,,,,,0,,,,,T,terres,,,2488,-0.326851,43.653762
2019-616415,2019-08-22,000001,Vente,128000,1059,,RTE DE PITOCQ,0220,40320,40305,Sorbets,40,,,403050000A0058,,,,,,,,,,,,,0,1,Maison,200,5,S,sols,,,1771,-0.317331,43.643314
2019-616415,2019-08-22,000001,Vente,128000,,,PLANTIER,B040,40320,40305,Sorbets,40,,,403050000A0059,,,,,,,,,,,,,0,,,,,J,jardins,,,1035,-0.317552,43.643465
2019-616415,2019-08-22,000001,Vente,128000,,,PLANTIER,B040,40320,40305,Sorbets,40,,,403050000A0330,,,,,,,,,,,,,0,,,,,T,terres,,,153,-0.31734,43.643588
2019-616415,2019-08-22,000001,Vente,128000,,,PLANTIER,B040,40320,40305,Sorbets,40,,,403050000A0332,,,,,,,,,,,,,0,,,,,J,jardins,,,577,-0.31772,43.643252
2019-616415,2019-08-22,000001,Vente,128000,,,PLANTIER,B040,40320,40305,Sorbets,40,,,403050000A0334,,,,,,,,,,,,,0,,,,,T,terres,,,199,-0.317754,43.643548
2019-616766,2019-09-19,000001,Vente,140000,,,L EGLISE,B010,40320,40305,Sorbets,40,,,403050000D0241,,,,,,,,,,,,,0,,,,,BT,taillis simples,,,530,-0.330532,43.637245
2019-616766,2019-09-19,000001,Vente,140000,,,L EGLISE,B010,40320,40305,Sorbets,40,,,403050000D0242,,,,,,,,,,,,,0,,,,,T,terres,,,5644,-0.329872,43.63705
2019-616766,2019-09-19,000001,Vente,140000,,,L EGLISE,B010,40320,40305,Sorbets,40,,,403050000D0243,,,,,,,,,,,,,0,,,,,J,jardins,,,684,-0.329789,43.636496
2019-616766,2019-09-19,000001,Vente,140000,148,,RTE DE PECORADE,0200,40320,40305,Sorbets,40,,,403050000D0244,,,,,,,,,,,,,0,1,Maison,171,4,S,sols,,,1402,-0.329402,43.636511
2019-616766,2019-09-19,000001,Vente,140000,,,L EGLISE,B010,40320,40305,Sorbets,40,,,403050000D0245,,,,,,,,,,,,,0,,,,,VI,vignes,,,3300,-0.329392,43.636171
2019-616766,2019-09-19,000001,Vente,140000,,,L EGLISE,B010,40320,40305,Sorbets,40,,,403050000D0246,,,,,,,,,,,,,0,,,,,T,terres,,,779,-0.328899,43.636541
2019-616766,2019-09-19,000001,Vente,140000,,,L EGLISE,B010,40320,40305,Sorbets,40,,,403050000D0246,,,,,,,,,,,,,0,,,,,VI,vignes,,,5209,-0.328899,43.636541
2019-616766,2019-09-19,000001,Vente,140000,,,L EGLISE,B010,40320,40305,Sorbets,40,,,403050000D0246,,,,,,,,,,,,,0,,,,,T,terres,,,1214,-0.328899,43.636541
2019-616766,2019-09-19,000001,Vente,140000,,,L EGLISE,B010,40320,40305,Sorbets,40,,,403050000D0246,,,,,,,,,,,,,0,,,,,S,sols,,,184,-0.328899,43.636541
2019-616766,2019-09-19,000001,Vente,140000,,,L EGLISE,B010,40320,40305,Sorbets,40,,,403050000D0247,,,,,,,,,,,,,0,,,,,T,terres,,,4580,-0.328621,43.637254
2019-616766,2019-09-19,000001,Vente,140000,,,L EGLISE,B010,40320,40305,Sorbets,40,,,403050000D0249,,,,,,,,,,,,,0,,,,,P,prés,,,5620,-0.327742,43.637468
2019-616766,2019-09-19,000001,Vente,140000,,,L EGLISE,B010,40320,40305,Sorbets,40,,,403050000D0250,,,,,,,,,,,,,0,,,,,T,terres,,,9944,-0.327323,43.63714
2019-616766,2019-09-19,000001,Vente,140000,,,L EGLISE,B010,40320,40305,Sorbets,40,,,403050000D0251,,,,,,,,,,,,,0,,,,,T,terres,,,5740,-0.326672,43.638073
2019-616766,2019-09-19,000001,Vente,140000,,,L EGLISE,B010,40320,40305,Sorbets,40,,,403050000D0253,,,,,,,,,,,,,0,,,,,T,terres,,,4573,-0.326143,43.637395
2019-617176,2019-09-09,000001,Vente,100000,1301,,RTE DE LATRILLE,0150,40320,40305,Sorbets,40,,,403050000B0440,,,,,,,,,,,,,0,1,Maison,77,3,J,jardins,,,1321,-0.317564,43.633324
2019-617176,2019-09-09,000001,Vente,100000,1301,,RTE DE LATRILLE,0150,40320,40305,Sorbets,40,,,403050000B0440,,,,,,,,,,,,,0,1,Maison,77,3,S,sols,,,844,-0.317564,43.633324
2019-617176,2019-09-09,000001,Vente,100000,1301,,RTE DE LATRILLE,0150,40320,40305,Sorbets,40,,,403050000B0440,,,,,,,,,,,,,0,1,Maison,77,3,T,terres,,,1821,-0.317564,43.633324
2019-617623,2019-10-04,000001,Vente,1,5001,,GUICHOT,B013,40320,40305,Sorbets,40,,,403050000D0059,,,,,,,,,,,,,0,4,Local industriel. commercial ou assimilé,,,L,landes,,,1540,-0.33378,43.652762
2019-617623,2019-10-04,000001,Vente,1,,,GUICHOT,B013,40320,40305,Sorbets,40,,,403050000D0060,,,,,,,,,,,,,0,,,,,L,landes,,,8424,-0.333289,43.653344
2019-617623,2019-10-04,000001,Vente,1,,,GUICHOT,B013,40320,40305,Sorbets,40,,,403050000D0822,,,,,,,,,,,,,0,,,,,L,landes,,,3465,-0.332415,43.652934
2019-617623,2019-10-04,000001,Vente,1,,,GUICHOT,B013,40320,40305,Sorbets,40,,,403050000D0824,,,,,,,,,,,,,0,,,,,L,landes,,,3756,-0.33337,43.652477
2019-617731,2019-10-04,000001,Vente,1,5001,,GUICHOT,B013,40320,40305,Sorbets,40,,,403050000D0059,,,,,,,,,,,,,0,4,Local industriel. commercial ou assimilé,,,L,landes,,,1540,-0.33378,43.652762
2019-617731,2019-10-04,000001,Vente,1,,,GUICHOT,B013,40320,40305,Sorbets,40,,,403050000D0060,,,,,,,,,,,,,0,,,,,L,landes,,,8424,-0.333289,43.653344
2019-617731,2019-10-04,000001,Vente,1,,,GUICHOT,B013,40320,40305,Sorbets,40,,,403050000D0061,,,,,,,,,,,,,0,,,,,L,landes,,,460,-0.332561,43.653351
2019-621389,2019-04-29,000001,Vente,105000,445,,RTE DE GUICHOT,0120,40320,40305,Sorbets,40,,,403050000D0028,,,,,,,,,,,,,0,1,Maison,127,7,S,sols,,,780,-0.338507,43.65147
2019-621389,2019-04-29,000001,Vente,105000,,,GUICHOT,B013,40320,40305,Sorbets,40,,,40305000ZA0036,,,,,,,,,,,,,0,,,,,PA,pâtures,PATUR,Pâture plantée,899,-0.33824,43.651705
