id_mutation,date_mutation,numero_disposition,nature_mutation,valeur_fonciere,adresse_numero,adresse_suffixe,adresse_nom_voie,adresse_code_voie,code_postal,code_commune,nom_commune,code_departement,ancien_code_commune,ancien_nom_commune,id_parcelle,ancien_id_parcelle,numero_volume,lot1_numero,lot1_surface_carrez,lot2_numero,lot2_surface_carrez,lot3_numero,lot3_surface_carrez,lot4_numero,lot4_surface_carrez,lot5_numero,lot5_surface_carrez,nombre_lots,code_type_local,type_local,surface_reelle_bati,nombre_pieces_principales,code_nature_culture,nature_culture,code_nature_culture_speciale,nature_culture_speciale,surface_terrain,longitude,latitude
2019-622378,2019-01-08,000002,Vente,1500,8,B,CHE DE LA FUYE,0068,41330,41009,Averdon,41,,,41009000ZN0056,,,,,,,,,,,,,0,1,Maison,115,4,T,terres,,,372,1.339533,47.690886
2019-622378,2019-01-08,000002,Vente,1500,,,MEZIERES,B106,41330,41009,Averdon,41,,,41009000ZN0132,,,,,,,,,,,,,0,,,,,T,terres,,,1144,1.339652,47.690918
2019-622378,2019-01-08,000002,Vente,1500,,,LE REBROU,B144,41330,41009,Averdon,41,,,41009000ZN0134,,,,,,,,,,,,,0,,,,,T,terres,,,2008,1.339254,47.690698
2019-623582,2019-03-19,000001,Vente,140000,21,,RUE DES MOISSONS,0095,41330,41009,Averdon,41,,,41009000AD0056,,,,,,,,,,,,,0,1,Maison,79,5,S,sols,,,263,1.299295,47.682951
2019-623582,2019-03-19,000001,Vente,140000,21,,RUE DES MOISSONS,0095,41330,41009,Averdon,41,,,41009000AD0056,,,,,,,,,,,,,0,1,Maison,79,5,AG,terrains d'agrément,,,909,1.299295,47.682951
2019-623615,2019-02-28,000001,Vente,75000,8,,PL DE LA MAIRIE,0079,41330,41009,Averdon,41,,,41009000AD0108,,,,,,,,,,,,,0,1,Maison,90,2,S,sols,,,626,,
2019-623615,2019-02-28,000001,Vente,75000,,,PL DE LA MAIRIE,0079,41330,41009,Averdon,41,,,41009000AD0113,,,,,,,,,,,,,0,,,,,S,sols,,,151,1.295429,47.683865
2019-625259,2019-06-05,000001,Vente,377000,,,CHALEAU,B027,41330,41009,Averdon,41,,,41009000AC0055,,,,,,,,,,,,,0,,,,,L,landes,,,68,1.289537,47.684145
2019-625259,2019-06-05,000001,Vente,377000,,,CHALEAU,B027,41330,41009,Averdon,41,,,41009000AC0056,,,,,,,,,,,,,0,,,,,L,landes,,,99,1.28959,47.684171
2019-625259,2019-06-05,000001,Vente,377000,15,,RUE DU MOULIN CHALOT,0100,41330,41009,Averdon,41,,,41009000AC0057,,,,,,,,,,,,,0,1,Maison,238,6,S,sols,,,1615,1.289482,47.684479
2019-625259,2019-06-05,000001,Vente,377000,,,CHALEAU,B027,41330,41009,Averdon,41,,,41009000AC0058,,,,,,,,,,,,,0,,,,,L,landes,,,6309,1.289844,47.684534
2019-625271,2019-05-25,000003,Vente,35000,4,,CHEM DES GARENNES,0070,41330,41009,Averdon,41,,,41009000AB0095,,,,,,,,,,,,,0,,,,,AG,terrains d'agrément,,,700,1.292131,47.682333
2019-625281,2019-05-23,000001,Vente,170000,,,LES ABATS,B002,41330,41009,Averdon,41,,,41009000AB0075,,,,,,,,,,,,,0,,,,,L,landes,,,145,1.291519,47.682472
2019-625281,2019-05-23,000001,Vente,170000,,,LES GARENNES,B067,41330,41009,Averdon,41,,,41009000AB0077,,,,,,,,,,,,,0,,,,,L,landes,,,212,1.291361,47.68253
2019-625281,2019-05-23,000001,Vente,170000,4,,CHEM DES GARENNES,0070,41330,41009,Averdon,41,,,41009000AB0092,,,,,,,,,,,,,0,1,Maison,101,4,AG,terrains d'agrément,,,2779,1.291742,47.682613
2019-625281,2019-05-23,000001,Vente,170000,4,,CHEM DES GARENNES,0070,41330,41009,Averdon,41,,,41009000AB0092,,,,,,,,,,,,,0,1,Maison,101,4,S,sols,,,500,1.291742,47.682613
2019-625316,2019-05-28,000001,Vente,160000,1,,HAMEAU DE MEZIERES,B086,41330,41009,Averdon,41,,,41009000ZL0039,,,,,,,,,,,,,0,1,Maison,95,3,AG,terrains d'agrément,,,1282,,
2019-625316,2019-05-28,000001,Vente,160000,1,,HAMEAU DE MEZIERES,B086,41330,41009,Averdon,41,,,41009000ZL0039,,,,,,,,,,,,,0,1,Maison,95,3,S,sols,,,1709,,
2019-627656,2019-09-18,000001,Vente,145000,23,,CHE DE LA GRAND PIERRE,0072,41330,41009,Averdon,41,,,41009000AE0077,,,,,,,,,,,,,0,1,Maison,165,4,S,sols,,,297,1.316697,47.679686
2019-627903,2019-09-16,000001,Vente,18000,140,A,LA NOUE CHOUARD,B113,41330,41009,Averdon,41,,,410090000H0186,,,,,,,,,,,,,0,1,Maison,15,1,L,landes,,,4750,1.282132,47.693818
2019-627903,2019-09-16,000001,Vente,18000,140,A,LA NOUE CHOUARD,B113,41330,41009,Averdon,41,,,410090000H0186,,,,,,,,,,,,,0,1,Maison,15,1,S,sols,,,300,1.282132,47.693818
2019-628549,2019-10-11,000001,Vente,600,,,LES GRANDES BRUYERES,B077,41330,41009,Averdon,41,,,410090000H0112,,,,,,,,,,,,,0,,,,,BT,taillis simples,,,1555,1.258212,47.694742
2019-628549,2019-10-11,000001,Vente,600,,,LES GRANDES BRUYERES,B077,41330,41009,Averdon,41,,,410090000H0113,,,,,,,,,,,,,0,,,,,BT,taillis simples,,,1625,1.258014,47.694639
2019-630102,2019-12-05,000001,Vente,135000,1,,HAMEAU DE MEZIERES,B086,41330,41009,Averdon,41,,,41009000ZL0051,,,,,,,,,,,,,0,,,,,S,sols,,,171,1.338013,47.691193
2019-630102,2019-12-05,000001,Vente,135000,1,,HAMEAU DE MEZIERES,B086,41330,41009,Averdon,41,,,41009000ZL0054,,,,,,,,,,,,,0,,,,,S,sols,,,500,,
2019-630102,2019-12-05,000001,Vente,135000,1,,HAMEAU DE MEZIERES,B086,41330,41009,Averdon,41,,,41009000ZL0054,,,,,,,,,,,,,0,,,,,AG,terrains d'agrément,,,872,,
2019-630102,2019-12-05,000001,Vente,135000,1,,HAMEAU DE MEZIERES,B086,41330,41009,Averdon,41,,,41009000ZL0055,,,,,,,,,,,,,0,,,,,S,sols,,,111,1.337661,47.691558
2019-630431,2019-12-16,000001,Vente,65000,1,,HAMEAU DE MEZIERES,B086,41330,41009,Averdon,41,,,41009000ZL0051,,,,,,,,,,,,,0,,,,,S,sols,,,171,1.338013,47.691193
2019-630431,2019-12-16,000001,Vente,65000,1,,HAMEAU DE MEZIERES,B086,41330,41009,Averdon,41,,,41009000ZL0052,,,,,,,,,,,,,0,,,,,S,sols,,,661,1.337816,47.691313
2019-630431,2019-12-16,000001,Vente,65000,1,,HAMEAU DE MEZIERES,B086,41330,41009,Averdon,41,,,41009000ZL0055,,,,,,,,,,,,,0,,,,,S,sols,,,111,1.337661,47.691558
