id_mutation,date_mutation,numero_disposition,nature_mutation,valeur_fonciere,adresse_numero,adresse_suffixe,adresse_nom_voie,adresse_code_voie,code_postal,code_commune,nom_commune,code_departement,ancien_code_commune,ancien_nom_commune,id_parcelle,ancien_id_parcelle,numero_volume,lot1_numero,lot1_surface_carrez,lot2_numero,lot2_surface_carrez,lot3_numero,lot3_surface_carrez,lot4_numero,lot4_surface_carrez,lot5_numero,lot5_surface_carrez,nombre_lots,code_type_local,type_local,surface_reelle_bati,nombre_pieces_principales,code_nature_culture,nature_culture,code_nature_culture_speciale,nature_culture_speciale,surface_terrain,longitude,latitude
2019-623694,2019-03-22,000001,Vente,115000,8,,RUE PIERRE DE RONSARD,0180,41190,41182,Pray,41,,,411820000B0696,,,,,,,,,,,,,0,1,Maison,68,4,S,sols,,,726,1.11569,47.677682
2019-623734,2019-03-08,000002,Vente,165000,11,,RUE PIERRE DE RONSARD,0180,41190,41182,Pray,41,,,41182000ZC0053,,,,,,,,,,,,,0,1,Maison,140,5,AG,terrains d'agrément,,,467,1.118117,47.678546
2019-623734,2019-03-08,000002,Vente,165000,11,,RUE PIERRE DE RONSARD,0180,41190,41182,Pray,41,,,41182000ZC0053,,,,,,,,,,,,,0,1,Maison,140,5,S,sols,,,331,1.118117,47.678546
2019-623734,2019-03-08,000002,Vente,165000,11,,RUE PIERRE DE RONSARD,0180,41190,41182,Pray,41,,,41182000ZC0053,,,,,,,,,,,,,0,1,Maison,140,5,AG,terrains d'agrément,,,90,1.118117,47.678546
2019-623734,2019-03-08,000002,Vente,165000,,,CANDIE,B015,41190,41182,Pray,41,,,41182000ZC0056,,,,,,,,,,,,,0,,,,,S,sols,,,237,1.118181,47.678673
2019-623734,2019-03-08,000002,Vente,165000,,,CANDIE,B015,41190,41182,Pray,41,,,41182000ZC0056,,,,,,,,,,,,,0,,,,,AG,terrains d'agrément,,,415,1.118181,47.678673
2019-623734,2019-03-08,000002,Vente,165000,,,CANDIE,B015,41190,41182,Pray,41,,,41182000ZC0057,,,,,,,,,,,,,0,,,,,AB,terrains a bâtir,,,145,1.118625,47.678445
2019-623734,2019-03-08,000002,Vente,165000,,,LE BOURG,B014,41190,41182,Pray,41,,,41182000ZC0062,,,,,,,,,,,,,0,,,,,AB,terrains a bâtir,,,571,1.118558,47.678337
2019-624886,2019-05-13,000001,Vente,27000,,,LES DEVANTS DE MIGNERAY,B028,41190,41182,Pray,41,,,41182000ZB0056,,,,,,,,,,,,,0,,,,,AB,terrains a bâtir,,,2346,1.120588,47.70126
2019-625058,2019-05-16,000001,Vente,30000,,,LES DEVANTS DE MIGNERAY,B028,41190,41182,Pray,41,,,41182000ZB0056,,,,,,,,,,,,,0,,,,,AB,terrains a bâtir,,,2346,1.120588,47.70126
2019-626109,2019-07-03,000001,Vente,21000,,,LES DEVANTS DE MIGNERAY,B028,41190,41182,Pray,41,,,41182000ZB0057,,,,,,,,,,,,,0,,,,,AB,terrains a bâtir,,,1523,1.120829,47.70143
2019-627334,2019-08-14,000001,Vente,2161.8,,,LES DEVANTS DE MIGNERAY,B028,41190,41182,Pray,41,,,41182000ZB0055,,,,,,,,,,,,,0,,,,,T,terres,,,1190,1.120672,47.700513
2019-627334,2019-08-14,000001,Vente,2161.8,,,LES DEVANTS DE MIGNERAY,B028,41190,41182,Pray,41,,,41182000ZB0058,,,,,,,,,,,,,0,,,,,AB,terrains a bâtir,,,2413,1.121286,47.70075
2019-628409,2019-10-10,000001,Vente,39500,5001,,LE BOURG,B014,41190,41182,Pray,41,,,411820000B0694,,,1,,2,,,,,,,,2,3,Dépendance,,0,,,,,,1.116316,47.676332
2019-628409,2019-10-10,000001,Vente,39500,1,,RUE FRANCOIS DE MUSSET,0075,41190,41182,Pray,41,,,411820000B0695,,,,,,,,,,,,,0,1,Maison,42,2,S,sols,,,351,1.116309,47.676483
2019-628409,2019-10-10,000001,Vente,39500,,,LE BOURG,B014,41190,41182,Pray,41,,,411820000B0710,,,,,,,,,,,,,0,,,,,S,sols,,,42,1.116257,47.676407
