id_mutation,date_mutation,numero_disposition,nature_mutation,valeur_fonciere,adresse_numero,adresse_suffixe,adresse_nom_voie,adresse_code_voie,code_postal,code_commune,nom_commune,code_departement,ancien_code_commune,ancien_nom_commune,id_parcelle,ancien_id_parcelle,numero_volume,lot1_numero,lot1_surface_carrez,lot2_numero,lot2_surface_carrez,lot3_numero,lot3_surface_carrez,lot4_numero,lot4_surface_carrez,lot5_numero,lot5_surface_carrez,nombre_lots,code_type_local,type_local,surface_reelle_bati,nombre_pieces_principales,code_nature_culture,nature_culture,code_nature_culture_speciale,nature_culture_speciale,surface_terrain,longitude,latitude
2019-639017,2019-01-15,000001,Vente,1800,,,AUX BARGES,B001,42110,42088,Épercieux-Saint-Paul,42,,,420880000B0009,,,,,,,,,,,,,0,,,,,P,prés,,,882,4.204198,45.790177
2019-639017,2019-01-15,000001,Vente,1800,,,AUX BARGES,B001,42110,42088,Épercieux-Saint-Paul,42,,,420880000B0010,,,,,,,,,,,,,0,,,,,T,terres,,,2620,4.204545,45.790457
2019-639270,2019-01-10,000002,Vente,50000,,,LE BOURG,B004,42110,42088,Épercieux-Saint-Paul,42,,,420880000B1237,,,,,,,,,,,,,0,,,,,S,sols,,,405,4.211837,45.79156
2019-639270,2019-01-10,000002,Vente,50000,,,LE BOURG,B004,42110,42088,Épercieux-Saint-Paul,42,,,420880000B1238,,,,,,,,,,,,,0,,,,,S,sols,,,37,4.211957,45.791594
2019-639533,2019-02-26,000001,Vente,61425,,,LA VIEILLE CURE,B020,42110,42088,Épercieux-Saint-Paul,42,,,420880000B1037,,,,,,,,,,,,,0,,,,,AB,terrains a bâtir,,,945,4.208268,45.790009
2019-639581,2019-02-21,000001,Vente,65000,553,,PL DES VAILLANTS,0090,42110,42088,Épercieux-Saint-Paul,42,,,420880000B0259,,,,,,,,,,,,,0,1,Maison,52,2,S,sols,,,72,4.203858,45.789598
2019-639581,2019-02-21,000001,Vente,65000,,,LA VIEILLE CURE,B020,42110,42088,Épercieux-Saint-Paul,42,,,420880000B0260,,,,,,,,,,,,,0,,,,,S,sols,,,67,4.203649,45.789536
2019-639581,2019-02-21,000001,Vente,65000,,,LA VIEILLE CURE,B020,42110,42088,Épercieux-Saint-Paul,42,,,420880000B0260,,,,,,,,,,,,,0,,,,,J,jardins,,,407,4.203649,45.789536
2019-640074,2019-04-23,000001,Vente,110000,,,LA VIEILLE CURE,B020,42110,42088,Épercieux-Saint-Paul,42,,,420880000B0223,,,,,,,,,,,,,0,,,,,BP,peupleraies,,,3220,4.209413,45.790576
2019-640074,2019-04-23,000001,Vente,110000,63,,CHE DE LA VESNE,0110,42110,42088,Épercieux-Saint-Paul,42,,,420880000B0224,,,,,,,,,,,,,0,1,Maison,74,4,S,sols,,,633,4.209149,45.791113
2019-640484,2019-05-20,000001,Vente,146050,11,,CHE DE L'AVENIR,0015,42110,42088,Épercieux-Saint-Paul,42,,,420880000B0990,,,,,,,,,,,,,0,1,Maison,147,6,S,sols,,,263,4.212414,45.790829
2019-640484,2019-05-20,000001,Vente,146050,11,,CHE DE L'AVENIR,0015,42110,42088,Épercieux-Saint-Paul,42,,,420880000B0990,,,,,,,,,,,,,0,1,Maison,147,6,J,jardins,,,1106,4.212414,45.790829
2019-640773,2019-06-12,000001,Vente,61425,,,LA VIEILLE CURE,B020,42110,42088,Épercieux-Saint-Paul,42,,,420880000B1035,,,,,,,,,,,,,0,,,,,AB,terrains a bâtir,,,945,4.208244,45.789509
2019-640988,2019-06-27,000001,Vente,300000,5077,A,LA VIEILLE CURE,B020,42110,42088,Épercieux-Saint-Paul,42,,,420880000B0711,,,,,,,,,,,,,0,4,Local industriel. commercial ou assimilé,986,0,S,sols,,,3075,4.207376,45.78858
2019-640988,2019-06-27,000001,Vente,300000,5077,A,LA VIEILLE CURE,B020,42110,42088,Épercieux-Saint-Paul,42,,,420880000B0711,,,,,,,,,,,,,0,4,Local industriel. commercial ou assimilé,291,0,S,sols,,,3075,4.207376,45.78858
2019-641071,2019-07-04,000001,Vente,198000,5003,,LA VIEILLE CURE,B020,42110,42088,Épercieux-Saint-Paul,42,,,420880000B1041,,,,,,,,,,,,,0,1,Maison,97,4,S,sols,,,949,4.207913,45.790932
2019-641414,2019-07-30,000001,Vente,95000,9001,,LE CHANASSON,B007,42110,42088,Épercieux-Saint-Paul,42,,,420880000B0984,,,,,,,,,,,,,0,4,Local industriel. commercial ou assimilé,220,0,S,sols,,,1740,4.212644,45.776202
2019-641505,2019-08-02,000001,Vente,2335,,,LES CHAMBONS,B006,42110,42088,Épercieux-Saint-Paul,42,,,42088000ZB0028,,,,,,,,,,,,,0,,,,,T,terres,,,4670,4.195696,45.788928
2019-641515,2019-07-31,000001,Vente,200000,,,BRIEL,B005,42110,42088,Épercieux-Saint-Paul,42,,,420880000B0601,,,,,,,,,,,,,0,,,,,T,terres,,,2055,4.218478,45.786009
2019-641515,2019-07-31,000001,Vente,200000,63,,BRIEL,B005,42110,42088,Épercieux-Saint-Paul,42,,,420880000B0963,,,,,,,,,,,,,0,1,Maison,110,5,T,terres,,,3498,4.218392,45.786349
2019-641515,2019-07-31,000001,Vente,200000,63,,BRIEL,B005,42110,42088,Épercieux-Saint-Paul,42,,,420880000B0963,,,,,,,,,,,,,0,1,Maison,110,5,S,sols,,,200,4.218392,45.786349
2019-641906,2019-09-09,000001,Vente,10,,,LES VALERINS,B018,42110,42088,Épercieux-Saint-Paul,42,,,42088000ZC0024,,,,,,,,,,,,,0,,,,,P,prés,,,1780,4.20087,45.777729
2019-641928,2019-08-28,000001,Vente,900000,5021,,LE BOURG,B004,42110,42088,Épercieux-Saint-Paul,42,,,420880000B0569,,,,,,,,,,,,,0,4,Local industriel. commercial ou assimilé,1016,0,S,sols,,,7510,4.211167,45.788795
2019-641928,2019-08-28,000001,Vente,900000,,,LE BOURG,B004,42110,42088,Épercieux-Saint-Paul,42,,,420880000B0883,,,,,,,,,,,,,0,,,,,S,sols,,,3944,4.212198,45.788265
2019-641928,2019-08-28,000001,Vente,900000,,,LE BOURG,B004,42110,42088,Épercieux-Saint-Paul,42,,,420880000B0885,,,,,,,,,,,,,0,,,,,S,sols,,,4041,4.211457,45.789522
2019-642122,2019-09-02,000001,Vente,58000,,,BRIEL,B005,42110,42088,Épercieux-Saint-Paul,42,,,420880000B1195,,,,,,,,,,,,,0,,,,,AB,terrains a bâtir,,,887,4.214712,45.785714
2019-642512,2019-10-28,000001,Vente,61425,,,LA VIEILLE CURE,B020,42110,42088,Épercieux-Saint-Paul,42,,,420880000B1038,,,,,,,,,,,,,0,,,,,AB,terrains a bâtir,,,945,4.208039,45.790158
2019-642668,2019-11-13,000001,Vente,3306,,,LES PRES VASSOILLE,B014,42110,42088,Épercieux-Saint-Paul,42,,,42088000ZB0047,,,,,,,,,,,,,0,,,,,P,prés,,,5800,4.199378,45.785147
2019-642757,2019-11-15,000001,Vente,41000,,,LE PETIT BOIS,B012,42110,42088,Épercieux-Saint-Paul,42,,,420880000B1264,,,,,,,,,,,,,0,,,,,AB,terrains a bâtir,,,408,4.210181,45.786803
2019-642757,2019-11-15,000001,Vente,41000,,,LE PETIT BOIS,B012,42110,42088,Épercieux-Saint-Paul,42,,,420880000B1265,,,,,,,,,,,,,0,,,,,AB,terrains a bâtir,,,402,4.210336,45.786786
2019-642961,2019-11-15,000001,Vente,41000,,,AUX BARGES,B001,42110,42088,Épercieux-Saint-Paul,42,,,420880000B0042,,,,,,,,,,,,,0,,,,,T,terres,,,4439,4.207238,45.794195
2019-642961,2019-11-15,000001,Vente,41000,,,AUX BARGES,B001,42110,42088,Épercieux-Saint-Paul,42,,,420880000B0045,,,,,,,,,,,,,0,,,,,T,terres,,,3177,4.208713,45.794126
2019-642961,2019-11-15,000001,Vente,41000,,,AUX REYNARDS,B015,42110,42088,Épercieux-Saint-Paul,42,,,420880000B0046,,,,,,,,,,,,,0,,,,,T,terres,,,1250,4.209507,45.794301
2019-642961,2019-11-15,000001,Vente,41000,,,LE BOURG,B004,42110,42088,Épercieux-Saint-Paul,42,,,420880000B0090,,,,,,,,,,,,,0,,,,,T,terres,,,6720,4.215484,45.790872
2019-642961,2019-11-15,000001,Vente,41000,,,BRIEL,B005,42110,42088,Épercieux-Saint-Paul,42,,,420880000B0320,,,,,,,,,,,,,0,,,,,P,prés,,,9430,4.213644,45.78501
2019-642961,2019-11-15,000001,Vente,41000,,,AUX BARGES,B001,42110,42088,Épercieux-Saint-Paul,42,,,420880000B1062,,,,,,,,,,,,,0,,,,,T,terres,,,271,4.20827,45.792878
2019-642961,2019-11-15,000001,Vente,41000,,,AUX BARGES,B001,42110,42088,Épercieux-Saint-Paul,42,,,420880000B1067,,,,,,,,,,,,,0,,,,,T,terres,,,4869,4.208909,45.792757
2019-642961,2019-11-15,000001,Vente,41000,,,LES VARENNES,B019,42110,42088,Épercieux-Saint-Paul,42,,,420880000C0085,,,,,,,,,,,,,0,,,,,T,terres,,,7070,4.207669,45.79697
2019-642961,2019-11-15,000001,Vente,41000,,,LES VARENNES,B019,42110,42088,Épercieux-Saint-Paul,42,,,420880000C0085,,,,,,,,,,,,,0,,,,,T,terres,,,7070,4.207669,45.79697
2019-642961,2019-11-15,000001,Vente,41000,,,LES CHAMBONS,B006,42110,42088,Épercieux-Saint-Paul,42,,,42088000ZB0026,,,,,,,,,,,,,0,,,,,T,terres,,,13590,4.195262,45.788706
2019-643031,2019-11-27,000001,Vente,118800,,,LE CHANASSON,B007,42110,42088,Épercieux-Saint-Paul,42,,,420880000B1217,,,,,,,,,,,,,0,,,,,T,terres,,,4950,4.216927,45.777279
2019-643093,2019-12-05,000001,Vente,213000,,,LE BOURG,B004,42110,42088,Épercieux-Saint-Paul,42,,,420880000B0971,,,,,,,,,,,,,0,,,,,S,sols,,,819,4.215441,45.787309
2019-643093,2019-12-05,000001,Vente,213000,218,,LOT LES TOURTERELLES 2,A011,42110,42088,Épercieux-Saint-Paul,42,,,420880000B1007,,,,,,,,,,,,,0,1,Maison,114,4,S,sols,,,882,4.216024,45.78699
2019-643093,2019-12-05,000001,Vente,213000,,,LE BOURG,B004,42110,42088,Épercieux-Saint-Paul,42,,,420880000B1008,,,,,,,,,,,,,0,,,,,S,sols,,,690,4.215866,45.787443
2019-643151,2019-12-16,000001,Vente,43500,,,LE BOURG,B004,42110,42088,Épercieux-Saint-Paul,42,,,420880000B1262,,,,,,,,,,,,,0,,,,,AB,terrains a bâtir,,,600,4.212876,45.790209
