id_mutation,date_mutation,numero_disposition,nature_mutation,valeur_fonciere,adresse_numero,adresse_suffixe,adresse_nom_voie,adresse_code_voie,code_postal,code_commune,nom_commune,code_departement,ancien_code_commune,ancien_nom_commune,id_parcelle,ancien_id_parcelle,numero_volume,lot1_numero,lot1_surface_carrez,lot2_numero,lot2_surface_carrez,lot3_numero,lot3_surface_carrez,lot4_numero,lot4_surface_carrez,lot5_numero,lot5_surface_carrez,nombre_lots,code_type_local,type_local,surface_reelle_bati,nombre_pieces_principales,code_nature_culture,nature_culture,code_nature_culture_speciale,nature_culture_speciale,surface_terrain,longitude,latitude
2019-647775,2019-02-05,000001,Vente,40000,,,LES VIGNES GRANDES,B121,43380,43031,Blassac,43,,,430310000A0219,,,,,,,,,,,,,0,,,,,T,terres,,,529,3.400414,45.171504
2019-647775,2019-02-05,000001,Vente,40000,,,LE BOURG,B013,43380,43031,Blassac,43,,,430310000G0184,,,,,,,,,,,,,0,,,,,T,terres,,,74,3.401129,45.169788
2019-647775,2019-02-05,000001,Vente,40000,,,LE BOURG,B013,43380,43031,Blassac,43,,,430310000G0207,,,,,,,,,,,,,0,,,,,S,sols,,,113,3.399832,45.170443
2019-647775,2019-02-05,000001,Vente,40000,5100,,LE BOURG,B013,43380,43031,Blassac,43,,,430310000G0213,,,,,,,,,,,,,0,1,Maison,42,1,S,sols,,,60,3.399711,45.170482
2019-647775,2019-02-05,000001,Vente,40000,5101,,LE BOURG,B013,43380,43031,Blassac,43,,,430310000G0217,,,,,,,,,,,,,0,1,Maison,100,3,S,sols,,,50,3.399631,45.170497
2019-647775,2019-02-05,000001,Vente,40000,,,LE BOURG,B013,43380,43031,Blassac,43,,,430310000G0218,,,,,,,,,,,,,0,,,,,S,sols,,,62,3.39956,45.170504
2019-647775,2019-02-05,000001,Vente,40000,,,LE BOURG,B013,43380,43031,Blassac,43,,,430310000G0219,,,,,,,,,,,,,0,,,,,S,sols,,,21,3.399554,45.170469
2019-648549,2019-03-19,000001,Vente,1620,,,LURADOU,B081,43380,43031,Blassac,43,,,430310000D0366,,,,,,,,,,,,,0,,,,,L,landes,,,15465,3.38365,45.155464
2019-648549,2019-03-19,000001,Vente,1620,,,SERRE DE LA BIZE,B114,43380,43031,Blassac,43,,,430310000D0410,,,,,,,,,,,,,0,,,,,BT,taillis simples,,,7670,3.377868,45.158329
2019-648549,2019-03-19,000001,Vente,1620,,,LA PLANTADE,B094,43380,43031,Blassac,43,,,430310000D0603,,,,,,,,,,,,,0,,,,,VI,vignes,,,1295,3.391918,45.153558
2019-648549,2019-03-19,000001,Vente,1620,,,LA PLANTADE,B094,43380,43031,Blassac,43,,,430310000D0603,,,,,,,,,,,,,0,,,,,L,landes,,,1295,3.391918,45.153558
2019-648549,2019-03-19,000001,Vente,1620,,,LA CROUX,B055,43380,43031,Blassac,43,,,430310000D0676,,,,,,,,,,,,,0,,,,,L,landes,,,920,3.393799,45.15333
2019-648549,2019-03-19,000001,Vente,1620,,,LA VIGNE DU PRADAL,B120,43380,43031,Blassac,43,,,430310000D0745,,,,,,,,,,,,,0,,,,,L,landes,,,265,3.392546,45.15163
2019-648554,2019-03-19,000001,Vente,710,,,ROCHASSOU,B107,43380,43031,Blassac,43,,,430310000D0183,,,,,,,,,,,,,0,,,,,L,landes,,,3075,3.393544,45.157954
2019-648554,2019-03-19,000001,Vente,710,,,ROCHASSOU,B107,43380,43031,Blassac,43,,,430310000D0184,,,,,,,,,,,,,0,,,,,L,landes,,,655,3.392877,45.157707
2019-648554,2019-03-19,000001,Vente,710,,,ROCHASSOU,B107,43380,43031,Blassac,43,,,430310000D0197,,,,,,,,,,,,,0,,,,,L,landes,,,2710,3.392568,45.157994
2019-648554,2019-03-19,000001,Vente,710,,,ROCHASSOU,B107,43380,43031,Blassac,43,,,430310000D0944,,,,,,,,,,,,,0,,,,,L,landes,,,435,3.393739,45.157936
2019-648576,2019-03-19,000001,Vente,290,,,ROCHASSOU,B107,43380,43031,Blassac,43,,,430310000D0181,,,,,,,,,,,,,0,,,,,L,landes,,,2790,3.393746,45.158403
2019-651448,2019-08-08,000001,Vente,192.9,,,LES CHARITAIRES,B031,43380,43031,Blassac,43,,,430310000F0214,,,,,,,,,,,,,0,,,,,P,prés,,,1920,3.366205,45.15986
2019-652945,2019-11-05,000001,Vente,32000,5107,,LE BOURG,B013,43380,43031,Blassac,43,,,430310000A0740,,,,,,,,,,,,,0,1,Maison,88,4,T,terres,,,1268,3.400347,45.171411
2019-653473,2019-12-04,000001,Vente,4500,,,CHANTEGRIS,B028,43380,43031,Blassac,43,,,430310000B0380,,,,,,,,,,,,,0,,,,,VI,vignes,,,1200,3.416708,45.168381
2019-653473,2019-12-04,000001,Vente,4500,,,CHANTEGRIS,B028,43380,43031,Blassac,43,,,430310000B0381,,,,,,,,,,,,,0,,,,,T,terres,,,3790,3.417063,45.168713
2019-653473,2019-12-04,000001,Vente,4500,,,CHANTEGRIS,B028,43380,43031,Blassac,43,,,430310000B0392,,,,,,,,,,,,,0,,,,,P,prés,,,3050,3.416683,45.168066
2019-654027,2019-12-27,000001,Vente,36020,5007,,LE BOURG,B013,43380,43031,Blassac,43,,,430310000G0208,,,,,,,,,,,,,0,1,Maison,92,3,S,sols,,,188,3.399789,45.170331
