id_mutation,date_mutation,numero_disposition,nature_mutation,valeur_fonciere,adresse_numero,adresse_suffixe,adresse_nom_voie,adresse_code_voie,code_postal,code_commune,nom_commune,code_departement,ancien_code_commune,ancien_nom_commune,id_parcelle,ancien_id_parcelle,numero_volume,lot1_numero,lot1_surface_carrez,lot2_numero,lot2_surface_carrez,lot3_numero,lot3_surface_carrez,lot4_numero,lot4_surface_carrez,lot5_numero,lot5_surface_carrez,nombre_lots,code_type_local,type_local,surface_reelle_bati,nombre_pieces_principales,code_nature_culture,nature_culture,code_nature_culture_speciale,nature_culture_speciale,surface_terrain,longitude,latitude
2019-647581,2019-01-22,000001,Vente,20000,,,PRE DE MADAME,B290,43450,43033,Blesle,43,,,430330000A0673,,,,,,,,,,,,,0,,,,,T,terres,,,93,3.182489,45.313418
2019-647581,2019-01-22,000001,Vente,20000,5335,,RUE EDOUARD CHATILLON,0065,43450,43033,Blesle,43,,,430330000G0452,,,,,,,,,,,,,0,1,Maison,50,2,S,sols,,,32,,
2019-647586,2019-01-23,000001,Vente,500,,,SERVIERES,B347,43450,43033,Blesle,43,,,43033000ZP0116,,,,,,,,,,,,,0,,,,,L,landes,,,852,3.208294,45.317631
2019-648132,2019-02-27,000001,Vente,10000,5040,,LA BESSIERE,B024,43450,43033,Blesle,43,,,430330000F0516,,,,,,,,,,,,,0,1,Maison,42,3,S,sols,,,740,,
2019-648132,2019-02-27,000001,Vente,10000,,,LA BESSIERE,B024,43450,43033,Blesle,43,,,430330000F0517,,,,,,,,,,,,,0,,,,,L,landes,,,717,,
2019-648132,2019-02-27,000001,Vente,10000,,,LA BESSIERE,B024,43450,43033,Blesle,43,,,430330000F0518,,,,,,,,,,,,,0,,,,,VI,vignes,,,433,,
2019-648314,2019-03-09,000001,Vente,13000,,,RUE DE LA BELLAN,0017,43450,43033,Blesle,43,,,430330000G0174,,,,,,,,,,,,,0,,,,,L,landes,,,74,,
2019-648314,2019-03-09,000001,Vente,13000,5087,,RUE DE LA BELLAN,0017,43450,43033,Blesle,43,,,430330000G0177,,,,,,,,,,,,,0,1,Maison,40,1,S,sols,,,35,,
2019-648700,2019-03-26,000001,Vente,55000,,,LA BESSIERE,B024,43450,43033,Blesle,43,,,430330000E0272,,,,,,,,,,,,,0,,,,,BT,taillis simples,,,3964,3.177487,45.31114
2019-648700,2019-03-26,000001,Vente,55000,5140,,RUE DE LA BONALE,0025,43450,43033,Blesle,43,,,430330000G0084,,,,,,,,,,,,,0,1,Maison,90,2,S,sols,,,65,,
2019-648700,2019-03-26,000001,Vente,55000,5135,,RUE DE LA BONALE,0025,43450,43033,Blesle,43,,,430330000G0086,,,1,,,,,,,,,,1,3,Dépendance,,0,,,,,,,
2019-649319,2019-05-02,000001,Vente,155000,1200,,LE BUCHERON,B055,43450,43033,Blesle,43,,,430330000F1579,,,,,,,,,,,,,0,1,Maison,148,4,AG,terrains d'agrément,,,842,,
2019-649319,2019-05-02,000001,Vente,155000,1200,,LE BUCHERON,B055,43450,43033,Blesle,43,,,430330000F1579,,,,,,,,,,,,,0,1,Maison,148,4,S,sols,,,500,,
2019-649326,2019-05-07,000001,Vente,6400,,,LA PRADE,B283,43450,43033,Blesle,43,,,430330000C0954,,,,,,,,,,,,,0,,,,,T,terres,,,9710,3.207676,45.305251
2019-649326,2019-05-07,000001,Vente,6400,,,LA PRADE,B283,43450,43033,Blesle,43,,,430330000C0959,,,,,,,,,,,,,0,,,,,T,terres,,,11570,3.210812,45.307326
2019-649404,2019-05-10,000001,Vente,55000,,,BLESLE,B028,43450,43033,Blesle,43,,,430330000G0369,,,,,,,,,,,,,0,,,,,T,terres,,,386,,
2019-649404,2019-05-10,000001,Vente,55000,,,BLESLE,B028,43450,43033,Blesle,43,,,430330000G0370,,,,,,,,,,,,,0,,,,,T,terres,,,387,,
2019-649404,2019-05-10,000001,Vente,55000,5368,,RUE EDOUARD CHATILLON,0065,43450,43033,Blesle,43,,,430330000G0702,,,,,,,,,,,,,0,1,Maison,55,3,S,sols,,,86,,
2019-649821,2019-05-22,000001,Vente,72000,,,RUE DE LA BONALE,0025,43450,43033,Blesle,43,,,430330000G0062,,,,,,,,,,,,,0,,,,,T,terres,,,130,,
2019-649821,2019-05-22,000001,Vente,72000,5178,,RUE DE LA BONALE,0025,43450,43033,Blesle,43,,,430330000G0628,,,,,,,,,,,,,0,1,Maison,42,2,S,sols,,,110,,
2019-649821,2019-05-22,000001,Vente,72000,5178,,RUE DE LA BONALE,0025,43450,43033,Blesle,43,,,430330000G0628,,,,,,,,,,,,,0,1,Maison,70,3,S,sols,,,110,,
2019-649821,2019-05-22,000001,Vente,72000,5175,,RUE DE LA BONALE,0025,43450,43033,Blesle,43,,,430330000G0632,,,,,,,,,,,,,0,3,Dépendance,,0,S,sols,,,29,,
2019-649853,2019-05-20,000002,Vente,2265,,,LA BESSIERE,B024,43450,43033,Blesle,43,,,430330000F1611,,,,,,,,,,,,,0,,,,,S,sols,,,113,,
2019-649853,2019-05-20,000002,Vente,2265,,,LA BESSIERE,B024,43450,43033,Blesle,43,,,430330000F1613,,,,,,,,,,,,,0,,,,,S,sols,,,38,,
2019-649858,2019-05-20,000001,Vente,7770,,,LA BESSIERE,B024,43450,43033,Blesle,43,,,430330000F1612,,,,,,,,,,,,,0,,,,,S,sols,,,518,,
2019-650326,2019-06-17,000001,Vente,44700,5693,G,LA BESSIERE,B024,43450,43033,Blesle,43,,,430330000F1463,,,,,,,,,,,,,0,1,Maison,96,5,S,sols,,,822,,
2019-650537,2019-07-06,000001,Vente,50000,5028,,PL DE LA MAIRIE,0100,43450,43033,Blesle,43,,,430330000G0680,,,,,,,,,,,,,0,1,Maison,99,2,S,sols,,,45,,
2019-650832,2019-07-19,000001,Vente,5000,5371,,RUE EDOUARD CHATILLON,0065,43450,43033,Blesle,43,,,430330000G0690,,,1,,,,,,,,,,1,3,Dépendance,,0,,,,,,,
2019-650867,2019-07-15,000001,Vente,2670,5693,C,LA BESSIERE,B024,43450,43033,Blesle,43,,,430330000F1483,,,,,,,,,,,,,0,,,,,S,sols,,,178,,
2019-650911,2019-07-19,000001,Vente,1750,,,LA FONTILLE,B200,43450,43033,Blesle,43,,,430330000A0347,,,,,,,,,,,,,0,,,,,L,landes,,,2250,3.178551,45.318605
2019-650911,2019-07-19,000001,Vente,1750,,,PRE DE MADAME,B290,43450,43033,Blesle,43,,,430330000A0662,,,,,,,,,,,,,0,,,,,P,prés,,,222,3.182003,45.312853
2019-650911,2019-07-19,000001,Vente,1750,,,SOUS LE ROC,B351,43450,43033,Blesle,43,,,430330000C0264,,,,,,,,,,,,,0,,,,,L,landes,,,2236,3.191385,45.311688
2019-650911,2019-07-19,000001,Vente,1750,,,SOUS LE ROC,B351,43450,43033,Blesle,43,,,430330000C0282,,,,,,,,,,,,,0,,,,,BT,taillis simples,,,5540,3.191912,45.308139
2019-650911,2019-07-19,000001,Vente,1750,,,SOUS LE ROC,B351,43450,43033,Blesle,43,,,430330000C0297,,,,,,,,,,,,,0,,,,,BT,taillis simples,,,1396,3.191962,45.311404
2019-650911,2019-07-19,000001,Vente,1750,,,LA BESSIERE,B024,43450,43033,Blesle,43,,,430330000F1310,,,,,,,,,,,,,0,,,,,T,terres,,,488,3.177742,45.312658
2019-650911,2019-07-19,000001,Vente,1750,,,LE MONTEY,B238,43450,43033,Blesle,43,,,430330000H1517,,,,,,,,,,,,,0,,,,,BT,taillis simples,,,620,3.156808,45.328473
2019-650911,2019-07-19,000001,Vente,1750,,,LE MASSADOU,B234,43450,43033,Blesle,43,,,430330000H1584,,,,,,,,,,,,,0,,,,,L,landes,,,943,3.163956,45.320835
2019-650911,2019-07-19,000001,Vente,1750,,,LE BONAL,B044,43450,43033,Blesle,43,,,430330000H1641,,,,,,,,,,,,,0,,,,,BT,taillis simples,,,1650,3.158491,45.321141
2019-650911,2019-07-19,000001,Vente,1750,,,LE BONAL,B044,43450,43033,Blesle,43,,,430330000H1672,,,,,,,,,,,,,0,,,,,L,landes,,,3345,3.155568,45.320816
2019-650911,2019-07-19,000001,Vente,1750,,,LE BONAL,B044,43450,43033,Blesle,43,,,430330000H1673,,,,,,,,,,,,,0,,,,,BT,taillis simples,,,18100,3.156137,45.321999
2019-650911,2019-07-19,000001,Vente,1750,,,LE BONAL,B044,43450,43033,Blesle,43,,,430330000H1686,,,,,,,,,,,,,0,,,,,L,landes,,,1690,3.154167,45.320293
2019-650911,2019-07-19,000001,Vente,1750,,,LE BONAL,B044,43450,43033,Blesle,43,,,430330000H1687,,,,,,,,,,,,,0,,,,,T,terres,,,146,3.154395,45.319815
2019-650911,2019-07-19,000001,Vente,1750,,,FERRIERE SOUS LE COLOMBIER,B193,43450,43033,Blesle,43,,,43033000ZI0042,,,,,,,,,,,,,0,,,,,P,prés,,,570,3.170487,45.307348
2019-651203,2019-07-30,000001,Echange,6000,,,LA LUCHE,B230,43450,43033,Blesle,43,,,430330000F0131,,,,,,,,,,,,,0,,,,,BT,taillis simples,,,4142,3.162034,45.287558
2019-651203,2019-07-30,000001,Echange,6000,,,LA LUCHE,B230,43450,43033,Blesle,43,,,430330000F0136,,,,,,,,,,,,,0,,,,,BT,taillis simples,,,6092,3.161946,45.288717
2019-651203,2019-07-30,000001,Echange,6000,,,L ADRAY,B001,43450,43033,Blesle,43,,,430330000F0199,,,,,,,,,,,,,0,,,,,BT,taillis simples,,,4485,3.162476,45.290398
2019-651203,2019-07-30,000001,Echange,6000,,,L ADRAY,B001,43450,43033,Blesle,43,,,430330000F0203,,,,,,,,,,,,,0,,,,,BT,taillis simples,,,1253,3.159834,45.291359
2019-651203,2019-07-30,000001,Echange,6000,,,L ADRAY,B001,43450,43033,Blesle,43,,,430330000F0204,,,,,,,,,,,,,0,,,,,BT,taillis simples,,,434,3.159357,45.29159
2019-651203,2019-07-30,000001,Echange,6000,,,L ADRAY,B001,43450,43033,Blesle,43,,,430330000F0206,,,,,,,,,,,,,0,,,,,BT,taillis simples,,,972,3.158669,45.292197
2019-651203,2019-07-30,000001,Echange,6000,,,L ADRAY,B001,43450,43033,Blesle,43,,,430330000F0207,,,,,,,,,,,,,0,,,,,BT,taillis simples,,,320,3.15843,45.292492
2019-651203,2019-07-30,000001,Echange,6000,,,L ADRAY,B001,43450,43033,Blesle,43,,,430330000F0208,,,,,,,,,,,,,0,,,,,BT,taillis simples,,,969,3.158798,45.29284
2019-651203,2019-07-30,000001,Echange,6000,,,L ADRAY,B001,43450,43033,Blesle,43,,,430330000F0210,,,,,,,,,,,,,0,,,,,BT,taillis simples,,,7403,3.15915,45.292656
2019-651203,2019-07-30,000001,Echange,6000,,,L ADRAY,B001,43450,43033,Blesle,43,,,430330000F0212,,,,,,,,,,,,,0,,,,,BT,taillis simples,,,3938,3.160133,45.29249
2019-651203,2019-07-30,000001,Echange,6000,,,L ADRAY,B001,43450,43033,Blesle,43,,,430330000F0213,,,,,,,,,,,,,0,,,,,BT,taillis simples,,,11273,3.160517,45.292115
2019-651203,2019-07-30,000001,Echange,6000,,,L ADRAY,B001,43450,43033,Blesle,43,,,430330000F0220,,,,,,,,,,,,,0,,,,,BT,taillis simples,,,4940,3.162432,45.291101
2019-651203,2019-07-30,000001,Echange,6000,,,L ADRAY,B001,43450,43033,Blesle,43,,,430330000F0221,,,,,,,,,,,,,0,,,,,BT,taillis simples,,,11470,3.162894,45.290959
2019-651203,2019-07-30,000001,Echange,6000,,,L ADRAY,B001,43450,43033,Blesle,43,,,430330000F0224,,,,,,,,,,,,,0,,,,,BT,taillis simples,,,3095,3.16522,45.291075
2019-651203,2019-07-30,000001,Echange,6000,,,PEUCHOT,B258,43450,43033,Blesle,43,,,430330000F0226,,,,,,,,,,,,,0,,,,,BT,taillis simples,,,29765,3.164941,45.293023
2019-651203,2019-07-30,000001,Echange,6000,,,PEUCHOT,B258,43450,43033,Blesle,43,,,430330000F0228,,,,,,,,,,,,,0,,,,,BT,taillis simples,,,20072,3.163196,45.292322
2019-651203,2019-07-30,000001,Echange,6000,,,PEUCHOT,B258,43450,43033,Blesle,43,,,430330000F0241,,,,,,,,,,,,,0,,,,,BT,taillis simples,,,4222,3.163793,45.293733
2019-651203,2019-07-30,000001,Echange,6000,,,LA LUCHE,B230,43450,43033,Blesle,43,,,430330000F1282,,,,,,,,,,,,,0,,,,,BT,taillis simples,,,863,3.163873,45.286895
2019-651229,2019-07-25,000001,Vente,1200,,,LE BONAL,B044,43450,43033,Blesle,43,,,430330000H1659,,,,,,,,,,,,,0,,,,,T,terres,,,3358,3.156751,45.321217
2019-651229,2019-07-25,000001,Vente,1200,,,LE BONAL,B044,43450,43033,Blesle,43,,,430330000H1660,,,,,,,,,,,,,0,,,,,T,terres,,,396,3.15671,45.320145
2019-651229,2019-07-25,000001,Vente,1200,,,LE BONAL,B044,43450,43033,Blesle,43,,,430330000H1661,,,,,,,,,,,,,0,,,,,T,terres,,,266,3.156578,45.320092
2019-651229,2019-07-25,000001,Vente,1200,,,LE BONAL,B044,43450,43033,Blesle,43,,,430330000H1664,,,,,,,,,,,,,0,,,,,BT,taillis simples,,,1901,3.156439,45.32126
2019-651229,2019-07-25,000001,Vente,1200,,,LE BONAL,B044,43450,43033,Blesle,43,,,430330000H1679,,,,,,,,,,,,,0,,,,,T,terres,,,13715,3.154364,45.321211
2019-651418,2019-08-12,000002,Vente,22.8,,,MERDAN,B236,43450,43033,Blesle,43,,,430330000H1939,,,,,,,,,,,,,0,,,,,BT,taillis simples,,,114,,
2019-651578,2019-08-24,000001,Vente,2000,,,PRE DE MADAME,B290,43450,43033,Blesle,43,,,430330000A0723,,,,,,,,,,,,,0,,,,,T,terres,,,770,,
2019-651591,2019-08-14,000002,Vente,12.6,,,LE RIF LONG,B326,43450,43033,Blesle,43,,,43033000ZW0116,,,,,,,,,,,,,0,,,,,BT,taillis simples,,,63,,
2019-651866,2019-09-02,000002,Vente,10.2,,,MERDAN,B236,43450,43033,Blesle,43,,,430330000H1941,,,,,,,,,,,,,0,,,,,BT,taillis simples,,,46,,
2019-651866,2019-09-02,000002,Vente,10.2,,,MERDAN,B236,43450,43033,Blesle,43,,,430330000H1942,,,,,,,,,,,,,0,,,,,BT,taillis simples,,,5,,
2019-651999,2019-09-20,000001,Vente,45000,5107,,RUE DE LA BELLAN,0017,43450,43033,Blesle,43,,,430330000G0747,,,,,,,,,,,,,0,1,Maison,44,2,S,sols,,,192,,
2019-651999,2019-09-20,000001,Vente,45000,5645,,BLESLE,B028,43450,43033,Blesle,43,,,430330000G0748,,,,,,,,,,,,,0,1,Maison,30,2,S,sols,,,16,,
2019-652168,2019-09-20,000002,Vente,16,,,MERDAN,B236,43450,43033,Blesle,43,,,430330000H1944,,,,,,,,,,,,,0,,,,,BT,taillis simples,,,7,,
2019-652168,2019-09-20,000002,Vente,16,,,MERDAN,B236,43450,43033,Blesle,43,,,430330000H1945,,,,,,,,,,,,,0,,,,,BT,taillis simples,,,75,,
2019-652265,2019-10-09,000001,Vente,150,,,PRE DE MONSIEUR,B291,43450,43033,Blesle,43,,,430330000A0626,,,,,,,,,,,,,0,,,,,T,terres,,,468,3.183988,45.312646
2019-652392,2019-09-30,000001,Vente,1500,,,LABADAL,B221,43450,43033,Blesle,43,,,430330000A0763,,,,,,,,,,,,,0,,,,,T,terres,,,293,,
2019-652392,2019-09-30,000001,Vente,1500,,,LABADAL,B221,43450,43033,Blesle,43,,,430330000A0764,,,,,,,,,,,,,0,,,,,BT,taillis simples,,,504,3.18159,45.315051
2019-652572,2019-10-14,000002,Vente,14,,,LE RIF LONG,B326,43450,43033,Blesle,43,,,43033000ZW0114,,,,,,,,,,,,,0,,,,,BT,taillis simples,,,69,,
2019-652971,2019-11-08,000001,Vente,39000,5008,,PL DU BREUIL,0045,43450,43033,Blesle,43,,,430330000G0316,,,,,,,,,,,,,0,1,Maison,68,3,S,sols,,,95,,
2019-652971,2019-11-08,000001,Vente,39000,5008,,PL DU BREUIL,0045,43450,43033,Blesle,43,,,430330000G0316,,,,,,,,,,,,,0,4,Local industriel. commercial ou assimilé,76,0,S,sols,,,95,,
2019-652996,2019-11-16,000001,Vente,200,,,BLESLE,B028,43450,43033,Blesle,43,,,430330000G0175,,,,,,,,,,,,,0,,,,,T,terres,,,90,,
2019-652997,2019-11-15,000001,Vente,38900,,,LES BOIS DU BOS,B040,43450,43033,Blesle,43,,,430330000H1456,,,,,,,,,,,,,0,,,,,BT,taillis simples,,,11140,3.159444,45.337432
2019-653000,2019-11-14,000001,Vente,700,,,VIGNE DES DAMES,B381,43450,43033,Blesle,43,,,430330000A0813,,,,,,,,,,,,,0,,,,,L,landes,,,222,,
2019-653018,2019-11-18,000001,Vente,1000,,,PEUCHOT,B258,43450,43033,Blesle,43,,,430330000F0230,,,,,,,,,,,,,0,,,,,BT,taillis simples,,,13930,3.161742,45.293548
2019-653033,2019-10-29,000001,Vente,110000,,,CHAMPARNAL,B110,43450,43033,Blesle,43,,,430330000A0068,,,,,,,,,,,,,0,,,,,BT,taillis simples,,,2330,3.196709,45.326366
2019-653033,2019-10-29,000001,Vente,110000,,,CHAMPARNAL,B110,43450,43033,Blesle,43,,,430330000A0086,,,,,,,,,,,,,0,,,,,BT,taillis simples,,,3642,3.196589,45.32737
2019-653033,2019-10-29,000001,Vente,110000,,,LE BABORY,B010,43450,43033,Blesle,43,,,430330000C0256,,,,,,,,,,,,,0,,,,,BT,taillis simples,,,1368,3.189019,45.31216
2019-653033,2019-10-29,000001,Vente,110000,,,LE BOIS DES PERES,B037,43450,43033,Blesle,43,,,430330000F0657,,,,,,,,,,,,,0,,,,,BT,taillis simples,,,1170,3.173904,45.315872
2019-653033,2019-10-29,000001,Vente,110000,5336,,RUE EDOUARD CHATILLON,0065,43450,43033,Blesle,43,,,430330000G0451,,,,,,,,,,,,,0,1,Maison,222,5,S,sols,,,426,,
2019-653831,2019-12-27,000001,Vente,59000,5552,,AUBEYRAT,B008,43450,43033,Blesle,43,,,43033000ZN0011,,,,,,,,,,,,,0,1,Maison,117,4,T,terres,,,1000,3.205052,45.333121
2019-653831,2019-12-27,000001,Vente,59000,5552,,AUBEYRAT,B008,43450,43033,Blesle,43,,,43033000ZN0011,,,,,,,,,,,,,0,1,Maison,117,4,S,sols,,,2180,3.205052,45.333121
2019-653973,2019-12-20,000001,Vente,10000,5174,,RUE DE LA BONALE,0025,43450,43033,Blesle,43,,,430330000G0033,,,,,,,,,,,,,0,3,Dépendance,,0,S,sols,,,35,,
2019-653974,2019-12-20,000001,Vente,80000,5239,,RUE EDOUARD CHATILLON,0065,43450,43033,Blesle,43,,,430330000G0554,,,,,,,,,,,,,0,1,Maison,81,3,S,sols,,,42,,
2019-654146,2019-12-05,000001,Adjudication,40000,5459,,BOUSSELARGUES,B050,43450,43033,Blesle,43,,,430330000I1112,,,,,,,,,,,,,0,1,Maison,26,1,S,sols,,,182,3.176558,45.343608
2019-654146,2019-12-05,000001,Adjudication,40000,5459,,BOUSSELARGUES,B050,43450,43033,Blesle,43,,,430330000I1112,,,,,,,,,,,,,0,1,Maison,93,4,S,sols,,,182,3.176558,45.343608
2019-654146,2019-12-05,000001,Adjudication,40000,,,CHAMP DES CHANVRES,B088,43450,43033,Blesle,43,,,43033000ZH0028,,,,,,,,,,,,,0,,,,,T,terres,,,440,3.176289,45.343452
