id_mutation,date_mutation,numero_disposition,nature_mutation,valeur_fonciere,adresse_numero,adresse_suffixe,adresse_nom_voie,adresse_code_voie,code_postal,code_commune,nom_commune,code_departement,ancien_code_commune,ancien_nom_commune,id_parcelle,ancien_id_parcelle,numero_volume,lot1_numero,lot1_surface_carrez,lot2_numero,lot2_surface_carrez,lot3_numero,lot3_surface_carrez,lot4_numero,lot4_surface_carrez,lot5_numero,lot5_surface_carrez,nombre_lots,code_type_local,type_local,surface_reelle_bati,nombre_pieces_principales,code_nature_culture,nature_culture,code_nature_culture_speciale,nature_culture_speciale,surface_terrain,longitude,latitude
2019-648283,2019-03-08,000001,Vente,450,,,LA COTE,B057,43210,43249,Valprivas,43,,,432490000Q1105,,,,,,,,,,,,,0,,,,,PA,pâtures,PATUR,Pâture plantée,3220,4.046417,45.301368
2019-648283,2019-03-08,000001,Vente,450,,,LA COTE,B057,43210,43249,Valprivas,43,,,432490000Q1135,,,,,,,,,,,,,0,,,,,BR,futaies résineuses,PIN,Pins,3170,4.046638,45.300003
2019-648569,2019-03-01,000001,Vente,40000,,,LE SEIGNEUR,B189,43210,43249,Valprivas,43,,,432490000A0795,,,,,,,,,,,,,0,,,,,T,terres,,,1468,4.033794,45.33078
2019-648569,2019-03-01,000001,Vente,40000,,,LE SEIGNEUR,B189,43210,43249,Valprivas,43,,,432490000A0795,,,,,,,,,,,,,0,,,,,T,terres,,,1467,4.033794,45.33078
2019-648569,2019-03-01,000001,Vente,40000,,,LE SEIGNEUR,B189,43210,43249,Valprivas,43,,,432490000A0796,,,,,,,,,,,,,0,,,,,P,prés,,,1840,4.033645,45.331234
2019-648569,2019-03-01,000001,Vente,40000,,,LE SEIGNEUR,B189,43210,43249,Valprivas,43,,,432490000A0796,,,,,,,,,,,,,0,,,,,P,prés,,,1840,4.033645,45.331234
2019-648667,2019-04-01,000001,Vente,2000,,,TIRAMANDE,B196,43210,43249,Valprivas,43,,,432490000A0207,,,,,,,,,,,,,0,,,,,BR,futaies résineuses,PIN,Pins,790,4.035291,45.340374
2019-648667,2019-04-01,000001,Vente,2000,,,TIRAMANDE,B196,43210,43249,Valprivas,43,,,432490000A0207,,,,,,,,,,,,,0,,,,,BR,futaies résineuses,PIN,Pins,790,4.035291,45.340374
2019-648667,2019-04-01,000001,Vente,2000,,,LES ROUTISSES,B180,43210,43249,Valprivas,43,,,432490000A2560,,,,,,,,,,,,,0,,,,,BR,futaies résineuses,PIN,Pins,1460,4.048834,45.318171
2019-648667,2019-04-01,000001,Vente,2000,,,LES ROUTISSES,B180,43210,43249,Valprivas,43,,,432490000A2560,,,,,,,,,,,,,0,,,,,BR,futaies résineuses,PIN,Pins,1460,4.048834,45.318171
2019-648667,2019-04-01,000001,Vente,2000,,,LES PRES,B157,43210,43249,Valprivas,43,,,432490000Q0538,,,,,,,,,,,,,0,,,,,BR,futaies résineuses,PIN,Pins,5050,4.037866,45.308755
2019-649621,2019-05-14,000001,Vente,33000,,,LE SEIGNEUR,B189,43210,43249,Valprivas,43,,,432490000A0783,,,,,,,,,,,,,0,,,,,P,prés,,,4665,4.032732,45.329047
2019-649621,2019-05-14,000001,Vente,33000,,,LE SEIGNEUR,B189,43210,43249,Valprivas,43,,,432490000A0783,,,,,,,,,,,,,0,,,,,PA,pâtures,PATUR,Pâture plantée,4665,4.032732,45.329047
2019-651090,2019-07-19,000001,Vente,400,,,L EUCHE,B083,43210,43249,Valprivas,43,,,432490000A0462,,,,,,,,,,,,,0,,,,,J,jardins,,,410,4.035578,45.335985
2019-651269,2019-07-30,000001,Vente,133500,5001,,CHOMONT OUEST,B045,43210,43249,Valprivas,43,,,432490000R1620,,,,,,,,,,,,,0,1,Maison,92,5,S,sols,,,1000,4.065793,45.308195
2019-651487,2019-08-05,000001,Vente,39000,203,,RUE GRANDE RUE,0290,43210,43249,Valprivas,43,,,432490000A1693,,,,,,,,,,,,,0,1,Maison,70,3,S,sols,,,39,4.045269,45.312499
2019-651487,2019-08-05,000001,Vente,39000,,,GOUBAUD,B105,43210,43249,Valprivas,43,,,432490000A2328,,,,,,,,,,,,,0,,,,,BR,futaies résineuses,PIN,Pins,5627,4.028293,45.321823
2019-651487,2019-08-05,000001,Vente,39000,,,GOUBAUD,B105,43210,43249,Valprivas,43,,,432490000A2329,,,,,,,,,,,,,0,,,,,BR,futaies résineuses,PIN,Pins,3580,4.028951,45.321433
2019-651487,2019-08-05,000001,Vente,39000,,,CHOMARASSE,B043,43210,43249,Valprivas,43,,,432490000P0161,,,,,,,,,,,,,0,,,,,P,prés,,,2754,4.05132,45.301837
2019-651487,2019-08-05,000001,Vente,39000,,,PEYROUX,B144,43210,43249,Valprivas,43,,,432490000Q0162,,,,,,,,,,,,,0,,,,,PA,pâtures,PATUR,Pâture plantée,1810,4.033332,45.31439
2019-651487,2019-08-05,000001,Vente,39000,,,PEYROUX,B144,43210,43249,Valprivas,43,,,432490000Q0171,,,,,,,,,,,,,0,,,,,PA,pâtures,PATUR,Pâture plantée,1100,4.035018,45.312525
2019-651487,2019-08-05,000001,Vente,39000,,,GOUBEAUD,B106,43210,43249,Valprivas,43,,,432490000Q0301,,,,,,,,,,,,,0,,,,,BR,futaies résineuses,PIN,Pins,3420,4.029725,45.319614
2019-651487,2019-08-05,000001,Vente,39000,,,GRANGEYRE SUD,B112,43210,43249,Valprivas,43,,,432490000Q0475,,,,,,,,,,,,,0,,,,,BR,futaies résineuses,PIN,Pins,5548,4.029908,45.309433
2019-651487,2019-08-05,000001,Vente,39000,,,GRANGEYRE SUD,B112,43210,43249,Valprivas,43,,,432490000Q0475,,,,,,,,,,,,,0,,,,,BR,futaies résineuses,PIN,Pins,2774,4.029908,45.309433
2019-651487,2019-08-05,000001,Vente,39000,,,RAZASSOUX,B164,43210,43249,Valprivas,43,,,432490000Q0702,,,,,,,,,,,,,0,,,,,L,landes,,,2516,4.038293,45.30303
2019-651704,2019-09-05,000001,Vente,1200,,,LES COTES DE LA BLOUE,B063,43210,43249,Valprivas,43,,,432490000R0803,,,,,,,,,,,,,0,,,,,BR,futaies résineuses,PIN,Pins,3925,4.068195,45.304167
2019-651704,2019-09-05,000001,Vente,1200,,,LES COTES DE LA BLOUE,B063,43210,43249,Valprivas,43,,,432490000R0803,,,,,,,,,,,,,0,,,,,BR,futaies résineuses,PIN,Pins,3925,4.068195,45.304167
2019-651704,2019-09-05,000001,Vente,1200,,,LES COTES DE LA BLOUE,B063,43210,43249,Valprivas,43,,,432490000R0807,,,,,,,,,,,,,0,,,,,T,terres,,,2800,4.068673,45.304489
2019-651704,2019-09-05,000001,Vente,1200,,,LES COTES DE LA BLOUE,B063,43210,43249,Valprivas,43,,,432490000R0808,,,,,,,,,,,,,0,,,,,P,prés,,,1240,4.069062,45.304622
2019-651704,2019-09-05,000001,Vente,1200,,,LES COTES DE LA BLOUE,B063,43210,43249,Valprivas,43,,,432490000R0810,,,,,,,,,,,,,0,,,,,T,terres,,,601,4.068003,45.305231
2019-651704,2019-09-05,000001,Vente,1200,,,LES COTES DE LA BLOUE,B063,43210,43249,Valprivas,43,,,432490000R0818,,,,,,,,,,,,,0,,,,,PA,pâtures,PATUR,Pâture plantée,1660,4.065042,45.301101
2019-651704,2019-09-05,000001,Vente,1200,,,LES COTES DE LA BLOUE,B063,43210,43249,Valprivas,43,,,432490000R0819,,,,,,,,,,,,,0,,,,,PA,pâtures,PATUR,Pâture plantée,5720,4.065278,45.301284
2019-652055,2019-09-30,000001,Vente,6000,,,LA CHAPUSE,B036,43210,43249,Valprivas,43,,,432490000A0988,,,,,,,,,,,,,0,,,,,P,prés,,,2620,4.054267,45.32042
2019-652055,2019-09-30,000001,Vente,6000,,,LA CHAPUSE,B036,43210,43249,Valprivas,43,,,432490000A0989,,,,,,,,,,,,,0,,,,,BR,futaies résineuses,PIN,Pins,4340,4.054339,45.320621
2019-652055,2019-09-30,000001,Vente,6000,,,LA CHAPUSE,B036,43210,43249,Valprivas,43,,,432490000A0990,,,,,,,,,,,,,0,,,,,BR,futaies résineuses,PIN,Pins,3900,4.054282,45.321492
2019-652055,2019-09-30,000001,Vente,6000,,,LA CHAPUSE,B036,43210,43249,Valprivas,43,,,432490000A0990,,,,,,,,,,,,,0,,,,,BR,futaies résineuses,PIN,Pins,3900,4.054282,45.321492
2019-652055,2019-09-30,000001,Vente,6000,,,LA CHAPUSE,B036,43210,43249,Valprivas,43,,,432490000A0991,,,,,,,,,,,,,0,,,,,BR,futaies résineuses,PIN,Pins,3220,4.053635,45.32125
2019-652055,2019-09-30,000001,Vente,6000,,,LA CHAPUSE,B036,43210,43249,Valprivas,43,,,432490000A0991,,,,,,,,,,,,,0,,,,,BR,futaies résineuses,PIN,Pins,3220,4.053635,45.32125
2019-652055,2019-09-30,000001,Vente,6000,,,LA BLEUE,B014,43210,43249,Valprivas,43,,,432490000A1007,,,,,,,,,,,,,0,,,,,PA,pâtures,PATUR,Pâture plantée,1140,4.050498,45.32122
2019-652055,2019-09-30,000001,Vente,6000,,,LA BLEUE,B014,43210,43249,Valprivas,43,,,432490000A1008,,,,,,,,,,,,,0,,,,,BR,futaies résineuses,PIN,Pins,525,4.050833,45.321375
2019-652055,2019-09-30,000001,Vente,6000,,,LA BLEUE,B014,43210,43249,Valprivas,43,,,432490000A1008,,,,,,,,,,,,,0,,,,,BR,futaies résineuses,PIN,Pins,525,4.050833,45.321375
2019-652055,2019-09-30,000001,Vente,6000,,,LA BLEUE,B014,43210,43249,Valprivas,43,,,432490000A1009,,,,,,,,,,,,,0,,,,,PA,pâtures,PATUR,Pâture plantée,1400,4.050298,45.321832
2019-652055,2019-09-30,000001,Vente,6000,,,LA BLEUE,B014,43210,43249,Valprivas,43,,,432490000A1010,,,,,,,,,,,,,0,,,,,BR,futaies résineuses,PIN,Pins,3390,4.050577,45.321889
2019-652055,2019-09-30,000001,Vente,6000,,,LA BLEUE,B014,43210,43249,Valprivas,43,,,432490000A1028,,,,,,,,,,,,,0,,,,,BR,futaies résineuses,PIN,Pins,680,4.051261,45.322529
2019-652055,2019-09-30,000001,Vente,6000,,,LA BLEUE,B014,43210,43249,Valprivas,43,,,432490000A1029,,,,,,,,,,,,,0,,,,,P,prés,,,3800,4.050705,45.322783
2019-652055,2019-09-30,000001,Vente,6000,,,LA BLEUE,B014,43210,43249,Valprivas,43,,,432490000A1030,,,,,,,,,,,,,0,,,,,PA,pâtures,PATUR,Pâture plantée,920,4.050173,45.323094
2019-652055,2019-09-30,000001,Vente,6000,,,LA BLEUE,B014,43210,43249,Valprivas,43,,,432490000A1031,,,,,,,,,,,,,0,,,,,BR,futaies résineuses,PIN,Pins,2936,4.050555,45.32322
2019-652055,2019-09-30,000001,Vente,6000,,,LES ROUTISSES,B180,43210,43249,Valprivas,43,,,432490000A1491,,,,,,,,,,,,,0,,,,,PA,pâtures,PATUR,Pâture plantée,1360,4.051233,45.320499
2019-652055,2019-09-30,000001,Vente,6000,,,LES ROUTISSES,B180,43210,43249,Valprivas,43,,,432490000A2875,,,,,,,,,,,,,0,,,,,L,landes,,,300,4.050416,45.321109
2019-652055,2019-09-30,000001,Vente,6000,,,RANQUIGNOUX OUEST,B162,43210,43249,Valprivas,43,,,432490000C0231,,,,,,,,,,,,,0,,,,,BR,futaies résineuses,PIN,Pins,748,4.064008,45.335808
2019-652055,2019-09-30,000001,Vente,6000,,,RANQUIGNOUX OUEST,B162,43210,43249,Valprivas,43,,,432490000C0231,,,,,,,,,,,,,0,,,,,BR,futaies résineuses,PIN,Pins,748,4.064008,45.335808
2019-652055,2019-09-30,000001,Vente,6000,,,LES EYSSARDS,B084,43210,43249,Valprivas,43,,,432490000C0619,,,,,,,,,,,,,0,,,,,BR,futaies résineuses,PIN,Pins,1300,4.072019,45.332343
2019-652055,2019-09-30,000001,Vente,6000,,,COMBE PAOURY,B053,43210,43249,Valprivas,43,,,432490000C0633,,,,,,,,,,,,,0,,,,,BR,futaies résineuses,PIN,Pins,1386,4.071152,45.333301
2019-652055,2019-09-30,000001,Vente,6000,,,SABLE LES ADREYS,B182,43210,43249,Valprivas,43,,,432490000C0666,,,,,,,,,,,,,0,,,,,BR,futaies résineuses,PIN,Pins,3380,4.066143,45.330135
2019-652055,2019-09-30,000001,Vente,6000,,,SABLE LES ADREYS,B182,43210,43249,Valprivas,43,,,432490000C0667,,,,,,,,,,,,,0,,,,,BR,futaies résineuses,PIN,Pins,4470,4.065665,45.330615
2019-652055,2019-09-30,000001,Vente,6000,,,LES BIARAIRES,B013,43210,43249,Valprivas,43,,,432490000C0861,,,,,,,,,,,,,0,,,,,BR,futaies résineuses,PIN,Pins,4225,4.066789,45.329864
2019-652055,2019-09-30,000001,Vente,6000,,,SAGNES,B186,43210,43249,Valprivas,43,,,432490000C0885,,,,,,,,,,,,,0,,,,,BR,futaies résineuses,PIN,Pins,2561,4.072387,45.331394
2019-652055,2019-09-30,000001,Vente,6000,,,CHOMARASSE,B043,43210,43249,Valprivas,43,,,432490000P0167,,,,,,,,,,,,,0,,,,,P,prés,,,3300,4.052147,45.30206
2019-652055,2019-09-30,000001,Vente,6000,,,CHOMARASSE,B043,43210,43249,Valprivas,43,,,432490000P0168,,,,,,,,,,,,,0,,,,,BR,futaies résineuses,PIN,Pins,576,4.052712,45.301895
2019-652055,2019-09-30,000001,Vente,6000,,,PEYRASSE,B142,43210,43249,Valprivas,43,,,432490000P0270,,,,,,,,,,,,,0,,,,,BR,futaies résineuses,PIN,Pins,2910,4.056959,45.293288
2019-652055,2019-09-30,000001,Vente,6000,,,ROCHE DE QUART,B175,43210,43249,Valprivas,43,,,432490000Q0893,,,,,,,,,,,,,0,,,,,BR,futaies résineuses,PIN,Pins,1361,4.024308,45.306321
2019-652055,2019-09-30,000001,Vente,6000,,,MOULIN DE FAURE,B131,43210,43249,Valprivas,43,,,432490000Q0895,,,,,,,,,,,,,0,,,,,BR,futaies résineuses,PIN,Pins,1200,4.024694,45.306782
2019-652055,2019-09-30,000001,Vente,6000,,,MOULIN DE FAURE,B131,43210,43249,Valprivas,43,,,432490000Q0914,,,,,,,,,,,,,0,,,,,PA,pâtures,PATUR,Pâture plantée,1174,4.025061,45.308247
2019-652055,2019-09-30,000001,Vente,6000,,,L HABLOU,B114,43210,43249,Valprivas,43,,,432490000R0774,,,,,,,,,,,,,0,,,,,PA,pâtures,PATUR,Pâture plantée,3420,4.075569,45.300891
2019-652055,2019-09-30,000001,Vente,6000,,,MARIOUX,B122,43210,43249,Valprivas,43,,,432490000R0892,,,,,,,,,,,,,0,,,,,BR,futaies résineuses,PIN,Pins,1824,4.061197,45.299506
2019-652055,2019-09-30,000001,Vente,6000,,,MARIOUX,B122,43210,43249,Valprivas,43,,,432490000R0904,,,,,,,,,,,,,0,,,,,BR,futaies résineuses,PIN,Pins,1640,4.061956,45.301224
2019-652055,2019-09-30,000001,Vente,6000,,,MARIOUX,B122,43210,43249,Valprivas,43,,,432490000R0905,,,,,,,,,,,,,0,,,,,BR,futaies résineuses,PIN,Pins,1584,4.061874,45.300922
2019-652055,2019-09-30,000001,Vente,6000,,,COMBE DE MICHEL,B052,43210,43249,Valprivas,43,,,432490000R1310,,,,,,,,,,,,,0,,,,,BR,futaies résineuses,PIN,Pins,1810,4.055685,45.309123
2019-652055,2019-09-30,000001,Vente,6000,,,MONCHAL,B128,43210,43249,Valprivas,43,,,432490000R1482,,,,,,,,,,,,,0,,,,,PA,pâtures,PATUR,Pâture plantée,1640,4.057192,45.301949
2019-652055,2019-09-30,000001,Vente,6000,,,MONCHAL,B128,43210,43249,Valprivas,43,,,432490000R1483,,,,,,,,,,,,,0,,,,,BR,futaies résineuses,PIN,Pins,1540,4.057208,45.302113
2019-652055,2019-09-30,000001,Vente,6000,,,MONCHAL,B128,43210,43249,Valprivas,43,,,432490000R1487,,,,,,,,,,,,,0,,,,,BR,futaies résineuses,PIN,Pins,777,4.058442,45.30231
2019-652198,2019-10-10,000001,Vente,1,,,RUE DU LAVOIR,0460,43210,43249,Valprivas,43,,,432490000A3272,,,,,,,,,,,,,0,,,,,J,jardins,,,38,4.045309,45.311092
2019-652478,2019-10-17,000001,Vente,600,,,LES PRES,B157,43210,43249,Valprivas,43,,,432490000Q0603,,,,,,,,,,,,,0,,,,,P,prés,,,2070,4.043074,45.306548
2019-652478,2019-10-17,000001,Vente,600,,,LES PRES,B157,43210,43249,Valprivas,43,,,432490000Q0604,,,,,,,,,,,,,0,,,,,T,terres,,,880,4.043258,45.306554
2019-652505,2019-10-24,000002,Vente,59000,,,LE BESSET,B012,43210,43249,Valprivas,43,,,432490000A3280,,,,,,,,,,,,,0,,,,,S,sols,,,254,4.02946,45.327813
2019-652585,2019-10-31,000001,Vente,500,,,LE BOURG,B021,43210,43249,Valprivas,43,,,432490000A1726,,,,,,,,,,,,,0,,,,,J,jardins,,,250,4.045152,45.313566
2019-653093,2019-11-27,000001,Vente,25000,127,,RUE GRANDE RUE,0290,43210,43249,Valprivas,43,,,432490000A3277,,,,,,,,,,,,,0,1,Maison,90,3,S,sols,,,141,4.045706,45.311844
2019-653464,2019-12-10,000001,Vente,4217,,,GAMPAUCHE,B095,43210,43249,Valprivas,43,,,432490000B0012,,,,,,,,,,,,,0,,,,,BR,futaies résineuses,PIN,Pins,5430,4.032162,45.347761
2019-653464,2019-12-10,000001,Vente,4217,,,BOIS DE LA COTE,B015,43210,43249,Valprivas,43,,,432490000B0153,,,,,,,,,,,,,0,,,,,BR,futaies résineuses,PIN,Pins,4430,4.027436,45.346818
2019-653464,2019-12-10,000001,Vente,4217,,,BOIS DE LA COTE,B015,43210,43249,Valprivas,43,,,432490000B0164,,,,,,,,,,,,,0,,,,,BR,futaies résineuses,PIN,Pins,8000,4.023621,45.346417
2019-653464,2019-12-10,000001,Vente,4217,,,LES SAGNES,B185,43210,43249,Valprivas,43,,,432490000B0342,,,,,,,,,,,,,0,,,,,BR,futaies résineuses,PIN,Pins,5610,4.048371,45.345614
2019-653464,2019-12-10,000001,Vente,4217,,,LE ROUCHAUD,B178,43210,43249,Valprivas,43,,,432490000B0390,,,,,,,,,,,,,0,,,,,BR,futaies résineuses,PIN,Pins,4650,4.048597,45.345089
2019-653691,2019-12-17,000001,Vente,85600,,,LE BOURG,B021,43210,43249,Valprivas,43,,,432490000A1886,,,,,,,,,,,,,0,,,,,S,sols,,,18,4.043789,45.311122
2019-653691,2019-12-17,000001,Vente,85600,54,,CHE DES PELERINS,0620,43210,43249,Valprivas,43,,,432490000A2452,,,,,,,,,,,,,0,1,Maison,100,4,S,sols,,,232,4.043802,45.310962
2019-653691,2019-12-17,000001,Vente,85600,52,,CHE DES PELERINS,0620,43210,43249,Valprivas,43,,,432490000A3242,,,,,,,,,,,,,0,,,,,S,sols,,,124,4.043704,45.311018
2019-653731,2019-12-16,000001,Vente,9944,,,PRAT MARAY,B150,43210,43249,Valprivas,43,,,432490000A0181,,,,,,,,,,,,,0,,,,,BR,futaies résineuses,PIN,Pins,820,4.031783,45.340726
2019-653731,2019-12-16,000001,Vente,9944,,,PRAT MARAY,B150,43210,43249,Valprivas,43,,,432490000A0182,,,,,,,,,,,,,0,,,,,P,prés,,,4990,4.032125,45.339954
2019-653731,2019-12-16,000001,Vente,9944,,,PRAT MARAY,B150,43210,43249,Valprivas,43,,,432490000A0182,,,,,,,,,,,,,0,,,,,P,prés,,,4990,4.032125,45.339954
2019-653731,2019-12-16,000001,Vente,9944,,,PRAT MARAY,B150,43210,43249,Valprivas,43,,,432490000A0183,,,,,,,,,,,,,0,,,,,BR,futaies résineuses,PIN,Pins,660,4.032353,45.340417
2019-653731,2019-12-16,000001,Vente,9944,,,LAIRELIER,B116,43210,43249,Valprivas,43,,,432490000B0031,,,,,,,,,,,,,0,,,,,BR,futaies résineuses,PIN,Pins,2750,4.034599,45.346819
2019-653731,2019-12-16,000001,Vente,9944,,,LAIRELIER,B116,43210,43249,Valprivas,43,,,432490000B0032,,,,,,,,,,,,,0,,,,,T,terres,,,3250,4.035437,45.34663
2019-653731,2019-12-16,000001,Vente,9944,,,LAIRELIER,B116,43210,43249,Valprivas,43,,,432490000B0033,,,,,,,,,,,,,0,,,,,PA,pâtures,PATUR,Pâture plantée,698,4.035908,45.346389
2019-653731,2019-12-16,000001,Vente,9944,,,LE GARAY,B097,43210,43249,Valprivas,43,,,432490000B0043,,,,,,,,,,,,,0,,,,,P,prés,,,4630,4.036089,45.344177
2019-653731,2019-12-16,000001,Vente,9944,,,LE BOURBOUX,B020,43210,43249,Valprivas,43,,,432490000B0056,,,,,,,,,,,,,0,,,,,PA,pâtures,PATUR,Pâture plantée,1740,4.03641,45.341798
2019-653731,2019-12-16,000001,Vente,9944,,,LE BOURBOUX,B020,43210,43249,Valprivas,43,,,432490000B0057,,,,,,,,,,,,,0,,,,,P,prés,,,6000,4.037172,45.342135
2019-653731,2019-12-16,000001,Vente,9944,,,LA GOUTTE,B107,43210,43249,Valprivas,43,,,432490000B0067,,,,,,,,,,,,,0,,,,,P,prés,,,7350,4.03465,45.342493
2019-653731,2019-12-16,000001,Vente,9944,,,LA GOUTTE,B107,43210,43249,Valprivas,43,,,432490000B0068,,,,,,,,,,,,,0,,,,,PA,pâtures,PATUR,Pâture plantée,2640,4.035138,45.342862
2019-653731,2019-12-16,000001,Vente,9944,,,LE PATURAL,B137,43210,43249,Valprivas,43,,,432490000B0367,,,,,,,,,,,,,0,,,,,T,terres,,,8987,4.041626,45.343111
2019-653731,2019-12-16,000001,Vente,9944,,,LE BOURBOUX,B020,43210,43249,Valprivas,43,,,432490000B1201,,,,,,,,,,,,,0,,,,,L,landes,,,146,4.038355,45.343279
2019-653731,2019-12-16,000001,Vente,9944,,,LE BOURBOUX,B020,43210,43249,Valprivas,43,,,432490000B1203,,,,,,,,,,,,,0,,,,,T,terres,,,5422,4.038169,45.342311
2019-653731,2019-12-16,000001,Vente,9944,,,LE BOURBOUX,B020,43210,43249,Valprivas,43,,,432490000B1203,,,,,,,,,,,,,0,,,,,T,terres,,,5421,4.038169,45.342311
2019-653731,2019-12-16,000001,Vente,9944,,,LE BOURBOUX,B020,43210,43249,Valprivas,43,,,432490000B1379,,,,,,,,,,,,,0,,,,,BR,futaies résineuses,PIN,Pins,9000,4.037644,45.341276
