id_mutation,date_mutation,numero_disposition,nature_mutation,valeur_fonciere,adresse_numero,adresse_suffixe,adresse_nom_voie,adresse_code_voie,code_postal,code_commune,nom_commune,code_departement,ancien_code_commune,ancien_nom_commune,id_parcelle,ancien_id_parcelle,numero_volume,lot1_numero,lot1_surface_carrez,lot2_numero,lot2_surface_carrez,lot3_numero,lot3_surface_carrez,lot4_numero,lot4_surface_carrez,lot5_numero,lot5_surface_carrez,nombre_lots,code_type_local,type_local,surface_reelle_bati,nombre_pieces_principales,code_nature_culture,nature_culture,code_nature_culture_speciale,nature_culture_speciale,surface_terrain,longitude,latitude
2019-693884,2019-01-18,000001,Vente,27000,5400,,LA BARATERIE,B030,44110,44153,Saint-Aubin-des-Châteaux,44,,,44153000YO0065,,,,,,,,,,,,,0,1,Maison,66,1,S,sols,,,720,-1.522992,47.692475
2019-693884,2019-01-18,000001,Vente,27000,,,LA BARATERIE,B030,44110,44153,Saint-Aubin-des-Châteaux,44,,,44153000YO0069,,,,,,,,,,,,,0,,,,,J,jardins,,,690,-1.522645,47.692229
2019-693884,2019-01-18,000001,Vente,27000,,,LA TORCHE,C849,44110,44153,Saint-Aubin-des-Châteaux,44,,,44153000YP0045,,,,,,,,,,,,,0,,,,,T,terres,,,2426,-1.522319,47.692683
2019-693965,2019-02-15,000001,Vente,11273,,,LA GRANDE LANDE,B800,44110,44153,Saint-Aubin-des-Châteaux,44,,,44153000ZT0052,,,,,,,,,,,,,0,,,,,CA,carrières,,,2040,-1.422488,47.692314
2019-693965,2019-02-15,000001,Vente,11273,,,LA GRANDE LANDE,B800,44110,44153,Saint-Aubin-des-Châteaux,44,,,44153000ZT0053,,,,,,,,,,,,,0,,,,,CA,carrières,,,16476,-1.421988,47.691881
2019-693965,2019-02-15,000001,Vente,11273,,,LA GRANDE LANDE,B800,44110,44153,Saint-Aubin-des-Châteaux,44,,,44153000ZT0110,,,,,,,,,,,,,0,,,,,CA,carrières,,,1272,-1.42251,47.692424
2019-693965,2019-02-15,000001,Vente,11273,,,LA GRANDE LANDE,B800,44110,44153,Saint-Aubin-des-Châteaux,44,,,44153000ZT0126,,,,,,,,,,,,,0,,,,,T,terres,,,36577,-1.420384,47.691094
2019-694042,2019-02-18,000001,Vente,156000,203,,CHERE,B352,44110,44153,Saint-Aubin-des-Châteaux,44,,,44153000ZI0028,,,,,,,,,,,,,0,1,Maison,115,5,AG,terrains d'agrément,,,1160,-1.45645,47.72788
2019-694042,2019-02-18,000001,Vente,156000,203,,CHERE,B352,44110,44153,Saint-Aubin-des-Châteaux,44,,,44153000ZI0028,,,,,,,,,,,,,0,1,Maison,115,5,S,sols,,,850,-1.45645,47.72788
2019-694058,2019-03-01,000001,Vente,75000,13,,RUE DU TERTRE,0666,44110,44153,Saint-Aubin-des-Châteaux,44,,,44153000AB0065,,,,,,,,,,,,,0,1,Maison,110,3,S,sols,,,215,-1.4838,47.719028
2019-694058,2019-03-01,000001,Vente,75000,,,LE BOURG LE TERTRE,B156,44110,44153,Saint-Aubin-des-Châteaux,44,,,44153000AB0371,,,,,,,,,,,,,0,,,,,S,sols,,,23,-1.483771,47.719096
2019-694178,2019-03-16,000001,Vente,78600,,,LA GRIPPAIS,B843,44110,44153,Saint-Aubin-des-Châteaux,44,,,44153000YS0096,,,,,,,,,,,,,0,,,,,S,sols,,,312,-1.504148,47.708618
2019-694178,2019-03-16,000001,Vente,78600,5555,,LA GRIPPAIS,B843,44110,44153,Saint-Aubin-des-Châteaux,44,,,44153000YS0205,,,,,,,,,,,,,0,1,Maison,88,4,S,sols,,,1582,-1.504299,47.708272
2019-694308,2019-04-06,000001,Vente,1,,,NICORD,C228,44110,44153,Saint-Aubin-des-Châteaux,44,,,44153000ZC0063,,,,,,,,,,,,,0,,,,,J,jardins,,,120,-1.508302,47.727048
2019-694331,2019-04-10,000001,Vente,110000,14,,RUE DES ACACIAS,0030,44110,44153,Saint-Aubin-des-Châteaux,44,,,44153000ZD0229,,,,,,,,,,,,,0,1,Maison,80,3,S,sols,,,750,-1.492559,47.724148
2019-694418,2019-04-15,000001,Vente,1000,,,LA MARRE DU PRE,C166,44110,44153,Saint-Aubin-des-Châteaux,44,,,441530000A0113,,,,,,,,,,,,,0,,,,,BT,taillis simples,,,1254,-1.52396,47.749478
2019-694500,2019-05-06,000001,Vente,80000,2,,RUE DU TERTRE,0666,44110,44153,Saint-Aubin-des-Châteaux,44,,,44153000AB0296,,,,,,,,,,,,,0,2,Appartement,37,2,S,sols,,,76,-1.48459,47.719009
2019-694500,2019-05-06,000001,Vente,80000,2,,RUE DU TERTRE,0666,44110,44153,Saint-Aubin-des-Châteaux,44,,,44153000AB0296,,,,,,,,,,,,,0,2,Appartement,45,2,S,sols,,,76,-1.48459,47.719009
2019-694778,2019-07-04,000001,Vente,13000,5742,,NICORD,C228,44110,44153,Saint-Aubin-des-Châteaux,44,,,44153000ZC0027,,,,,,,,,,,,,0,1,Maison,27,1,AG,terrains d'agrément,,,2736,-1.511383,47.729076
2019-694837,2019-07-05,000001,Vente,162000,5198,,LA BORGNERIE,B137,44110,44153,Saint-Aubin-des-Châteaux,44,,,44153000ZE0070,,,,,,,,,,,,,0,1,Maison,165,6,S,sols,,,2098,-1.482001,47.735378
2019-694837,2019-07-05,000001,Vente,162000,5198,,LA BORGNERIE,B137,44110,44153,Saint-Aubin-des-Châteaux,44,,,44153000ZE0070,,,,,,,,,,,,,0,1,Maison,165,6,J,jardins,,,470,-1.482001,47.735378
2019-694837,2019-07-05,000001,Vente,162000,,,LE BOIS JANVIER,B125,44110,44153,Saint-Aubin-des-Châteaux,44,,,44153000ZE0072,,,,,,,,,,,,,0,,,,,J,jardins,,,800,-1.481473,47.735618
2019-694837,2019-07-05,000001,Vente,162000,,,LE BOIS JANVIER,B125,44110,44153,Saint-Aubin-des-Châteaux,44,,,44153000ZE0073,,,,,,,,,,,,,0,,,,,S,sols,,,18,-1.482626,47.7354
2019-694859,2019-06-27,000001,Vente,41000,36,,LA TRIONNAIS,C869,44110,44153,Saint-Aubin-des-Châteaux,44,,,44153000YE0071,,,,,,,,,,,,,0,1,Maison,44,2,J,jardins,,,687,-1.477569,47.698901
2019-694859,2019-06-27,000001,Vente,41000,36,,LA TRIONNAIS,C869,44110,44153,Saint-Aubin-des-Châteaux,44,,,44153000YE0071,,,,,,,,,,,,,0,1,Maison,44,2,S,sols,,,800,-1.477569,47.698901
2019-694920,2019-07-08,000001,Vente,131000,,,LA JAUNAIS,B950,44110,44153,Saint-Aubin-des-Châteaux,44,,,44153000YO0007,,,,,,,,,,,,,0,,,,,T,terres,,,559,-1.52559,47.697353
2019-694920,2019-07-08,000001,Vente,131000,,,LA JAUNAIS,B950,44110,44153,Saint-Aubin-des-Châteaux,44,,,44153000YO0008,,,,,,,,,,,,,0,,,,,T,terres,,,7928,-1.526437,47.696386
2019-694920,2019-07-08,000001,Vente,131000,,,LA GOUSSETIERE,B768,44110,44153,Saint-Aubin-des-Châteaux,44,,,44153000YO0056,,,,,,,,,,,,,0,,,,,L,landes,,,112,-1.524937,47.697376
2019-694920,2019-07-08,000001,Vente,131000,,,LA GOUSSETIERE,B768,44110,44153,Saint-Aubin-des-Châteaux,44,,,44153000YO0057,,,,,,,,,,,,,0,,,,,L,landes,,,320,-1.525066,47.697294
2019-694920,2019-07-08,000001,Vente,131000,,,LA GOUSSETIERE,B768,44110,44153,Saint-Aubin-des-Châteaux,44,,,44153000YO0059,,,,,,,,,,,,,0,,,,,J,jardins,,,1584,-1.525731,47.697078
2019-694920,2019-07-08,000001,Vente,131000,,,LA GOUSSETIERE,B768,44110,44153,Saint-Aubin-des-Châteaux,44,,,44153000YO0059,,,,,,,,,,,,,0,,,,,S,sols,,,1000,-1.525731,47.697078
2019-694920,2019-07-08,000001,Vente,131000,,,LA GOUSSETIERE,B768,44110,44153,Saint-Aubin-des-Châteaux,44,,,44153000YO0060,,,,,,,,,,,,,0,,,,,S,sols,,,290,-1.52546,47.697081
2019-694920,2019-07-08,000001,Vente,131000,,,LA GOUSSETIERE,B768,44110,44153,Saint-Aubin-des-Châteaux,44,,,44153000YO0083,,,,,,,,,,,,,0,,,,,J,jardins,,,98,-1.525473,47.697009
2019-694920,2019-07-08,000001,Vente,131000,,,LA GOUSSETIERE,B768,44110,44153,Saint-Aubin-des-Châteaux,44,,,44153000YO0084,,,,,,,,,,,,,0,,,,,J,jardins,,,42,-1.525336,47.69707
2019-694920,2019-07-08,000001,Vente,131000,,,LA GOUSSETIERE,B768,44110,44153,Saint-Aubin-des-Châteaux,44,,,44153000YO0085,,,,,,,,,,,,,0,,,,,J,jardins,,,14,-1.525273,47.697091
2019-694920,2019-07-08,000001,Vente,131000,5413,,LA GOUSSETIERE,B768,44110,44153,Saint-Aubin-des-Châteaux,44,,,44153000YP0132,,,,,,,,,,,,,0,1,Maison,80,4,S,sols,,,52,-1.525033,47.697053
2019-694927,2019-07-22,000001,Vente,31600,,,LES COMMUNS,B531,44110,44153,Saint-Aubin-des-Châteaux,44,,,44153000YA0127,,,,,,,,,,,,,0,,,,,T,terres,,,1099,-1.47487,47.677866
2019-694927,2019-07-22,000001,Vente,31600,,,LA JAUNAIS DES BOIS,B967,44110,44153,Saint-Aubin-des-Châteaux,44,,,44153000YB0020,,,,,,,,,,,,,0,,,,,T,terres,,,13326,-1.476068,47.679729
2019-694927,2019-07-22,000001,Vente,31600,,,LA JAUNAIS DES BOIS,B967,44110,44153,Saint-Aubin-des-Châteaux,44,,,44153000YB0020,,,,,,,,,,,,,0,,,,,S,sols,,,8000,-1.476068,47.679729
2019-694927,2019-07-22,000001,Vente,31600,,,LA JAUNAIS DES BOIS,B967,44110,44153,Saint-Aubin-des-Châteaux,44,,,44153000YB0020,,,,,,,,,,,,,0,,,,,T,terres,,,13326,-1.476068,47.679729
2019-694927,2019-07-22,000001,Vente,31600,,,LES BOUDONNIERES,B141,44110,44153,Saint-Aubin-des-Châteaux,44,,,44153000YB0021,,,,,,,,,,,,,0,,,,,T,terres,,,38390,-1.477499,47.676697
2019-694927,2019-07-22,000001,Vente,31600,,,LES BOUDONNIERES,B141,44110,44153,Saint-Aubin-des-Châteaux,44,,,44153000YB0021,,,,,,,,,,,,,0,,,,,S,sols,,,6635,-1.477499,47.676697
2019-694927,2019-07-22,000001,Vente,31600,,,L ECOBU,B598,44110,44153,Saint-Aubin-des-Châteaux,44,,,44153000YB0055,,,,,,,,,,,,,0,,,,,S,sols,,,7305,-1.475798,47.679854
2019-694939,2019-07-24,000001,Vente,198000,436,,LA BOURRUAIS,B158,44110,44153,Saint-Aubin-des-Châteaux,44,,,44153000YE0105,,,,,,,,,,,,,0,1,Maison,128,4,S,sols,,,669,-1.480979,47.699795
2019-694939,2019-07-24,000001,Vente,198000,,,LES CHENES VERTS,B748,44110,44153,Saint-Aubin-des-Châteaux,44,,,44153000YE0106,,,,,,,,,,,,,0,,,,,S,sols,,,165,-1.481093,47.69966
2019-694939,2019-07-24,000001,Vente,198000,,,LES CHENES VERTS,B748,44110,44153,Saint-Aubin-des-Châteaux,44,,,44153000YE0107,,,,,,,,,,,,,0,,,,,S,sols,,,671,-1.480713,47.699817
2019-694939,2019-07-24,000001,Vente,198000,,,LES CHENES VERTS,B748,44110,44153,Saint-Aubin-des-Châteaux,44,,,44153000YE0108,,,,,,,,,,,,,0,,,,,S,sols,,,212,-1.480809,47.699564
2019-694939,2019-07-24,000001,Vente,198000,,,LES CHENES VERTS,B748,44110,44153,Saint-Aubin-des-Châteaux,44,,,44153000YE0112,,,,,,,,,,,,,0,,,,,J,jardins,,,2455,-1.481101,47.699268
2019-694954,2019-07-12,000001,Vente,50000,21,,RUE DU TERTRE,0666,44110,44153,Saint-Aubin-des-Châteaux,44,,,44153000AB0196,,,,,,,,,,,,,0,1,Maison,75,3,S,sols,,,247,-1.483619,47.718739
2019-694955,2019-07-18,000001,Vente,80000,,,LE MORTIER,C204,44110,44153,Saint-Aubin-des-Châteaux,44,,,44153000YS0054,,,,,,,,,,,,,0,,,,,T,terres,,,669,-1.517346,47.70901
2019-694955,2019-07-18,000001,Vente,80000,5543,,LA GOUDAIS,B765,44110,44153,Saint-Aubin-des-Châteaux,44,,,44153000YS0152,,,,,,,,,,,,,0,1,Maison,153,5,S,sols,,,577,-1.517406,47.70863
2019-695059,2019-07-27,000001,Vente,1,,,LE PRE DES BEUVES,C548,44110,44153,Saint-Aubin-des-Châteaux,44,,,44153000ZB0065,,,,,,,,,,,,,0,,,,,BT,taillis simples,,,6760,-1.498533,47.736345
2019-695059,2019-07-27,000001,Vente,1,,,LE PRE DES BEUVES,C548,44110,44153,Saint-Aubin-des-Châteaux,44,,,44153000ZB0066,,,,,,,,,,,,,0,,,,,BT,taillis simples,,,6260,-1.499513,47.735929
2019-695059,2019-07-27,000001,Vente,1,,,LE PRE DE LA FILIERE,C480,44110,44153,Saint-Aubin-des-Châteaux,44,,,44153000ZB0068,,,,,,,,,,,,,0,,,,,P,prés,,,6832,-1.50076,47.735068
2019-695059,2019-07-27,000001,Vente,1,,,LE PRE DES BEUVES,C548,44110,44153,Saint-Aubin-des-Châteaux,44,,,44153000ZB0067,,,,,,,,,,,,,0,,,,,E,eaux,,,780,-1.499955,47.736054
2019-695059,2019-07-27,000001,Vente,1,,,LE PRE DES BEUVES,C548,44110,44153,Saint-Aubin-des-Châteaux,44,,,44153000ZB0067,,,,,,,,,,,,,0,,,,,BS,taillis sous futaie,,,4260,-1.499955,47.736054
2019-695071,2019-07-31,000001,Vente,5500,17,,LE PERRAY,C276,44110,44153,Saint-Aubin-des-Châteaux,44,,,44153000ZH0117,,,,,,,,,,,,,0,,,,,S,sols,,,485,-1.465186,47.723857
2019-695199,2019-08-26,000001,Vente,48432,,,LES CHINTRES,B364,44110,44153,Saint-Aubin-des-Châteaux,44,,,44153000ZE0039,,,,,,,,,,,,,0,,,,,T,terres,,,3613,-1.471087,47.733661
2019-695199,2019-08-26,000001,Vente,48432,,,LES CHINTRES,B364,44110,44153,Saint-Aubin-des-Châteaux,44,,,44153000ZE0039,,,,,,,,,,,,,0,,,,,T,terres,,,3612,-1.471087,47.733661
2019-695199,2019-08-26,000001,Vente,48432,5206,,LE BOISLOUEL,B127,44110,44153,Saint-Aubin-des-Châteaux,44,,,44153000ZH0063,,,,,,,,,,,,,0,1,Maison,90,3,S,sols,,,1960,-1.472773,47.730873
2019-695207,2019-08-21,000001,Vente,3500,,,LE BOURG LA GODINAIS,B153,44110,44153,Saint-Aubin-des-Châteaux,44,,,44153000AB0177,,,,,,,,,,,,,0,,,,,VE,vergers,,,1132,-1.488207,47.720429
2019-695207,2019-08-21,000001,Vente,3500,,,LE BOURG LA GODINAIS,B153,44110,44153,Saint-Aubin-des-Châteaux,44,,,44153000AB0236,,,,,,,,,,,,,0,,,,,P,prés,,,5,-1.487926,47.720139
2019-695207,2019-08-21,000001,Vente,3500,,,LE BOURG LA GODINAIS,B153,44110,44153,Saint-Aubin-des-Châteaux,44,,,44153000AB0239,,,,,,,,,,,,,0,,,,,P,prés,,,615,-1.488265,47.720252
2019-695275,2019-09-06,000001,Vente,192000,5267,,L OISELIERE,C146,44110,44153,Saint-Aubin-des-Châteaux,44,,,44153000ZP0110,,,,,,,,,,,,,0,1,Maison,150,4,S,sols,,,967,-1.444224,47.70417
2019-695275,2019-09-06,000001,Vente,192000,,,L OISELIERE,C146,44110,44153,Saint-Aubin-des-Châteaux,44,,,44153000ZP0113,,,,,,,,,,,,,0,,,,,S,sols,,,768,-1.444375,47.703957
2019-695298,2019-09-03,000001,Vente,8500,,,LA LANDE DE LA MESSARDIERE,C031,44110,44153,Saint-Aubin-des-Châteaux,44,,,441530000A0985,,,,,,,,,,,,,0,,,,,BR,futaies résineuses,,,10860,-1.480497,47.719752
2019-695300,2019-09-06,000001,Vente,91000,13,,RUE DE CHATEAUBRIANT,0045,44110,44153,Saint-Aubin-des-Châteaux,44,,,44153000AB0030,,,,,,,,,,,,,0,1,Maison,114,3,S,sols,,,198,-1.484311,47.72055
2019-695345,2019-09-19,000001,Vente,1000,,,LA RIAUBERT,C770,44110,44153,Saint-Aubin-des-Châteaux,44,,,441530000A0035,,,,,,,,,,,,,0,,,,,T,terres,,,5000,-1.520599,47.737128
2019-695383,2019-09-26,000001,Vente,584,,,LE CHP DU PAS,B422,44110,44153,Saint-Aubin-des-Châteaux,44,,,441530000A0019,,,,,,,,,,,,,0,,,,,P,prés,,,2920,-1.522404,47.736412
2019-695464,2019-09-30,000001,Vente,29423,,,LES CHENAIES,B331,44110,44153,Saint-Aubin-des-Châteaux,44,,,44153000ZC0001,,,,,,,,,,,,,0,,,,,T,terres,,,17476,-1.521877,47.732995
2019-695464,2019-09-30,000001,Vente,29423,,,LES CHENAIES,B331,44110,44153,Saint-Aubin-des-Châteaux,44,,,44153000ZC0002,,,,,,,,,,,,,0,,,,,T,terres,,,87610,-1.520055,47.733438
2019-695605,2019-10-09,000001,Vente,140250,5200,,LA BORGNERIE,B137,44110,44153,Saint-Aubin-des-Châteaux,44,,,44153000ZE0077,,,,,,,,,,,,,0,1,Maison,99,4,S,sols,,,872,-1.481986,47.733932
2019-695605,2019-10-09,000001,Vente,140250,,,LA BORGNERIE,B137,44110,44153,Saint-Aubin-des-Châteaux,44,,,44153000ZE0080,,,,,,,,,,,,,0,,,,,AG,terrains d'agrément,,,1128,-1.48173,47.733952
2019-695659,2019-10-25,000001,Vente,11165.22,,,LES COUDRES,B544,44110,44153,Saint-Aubin-des-Châteaux,44,,,44153000ZH0033,,,,,,,,,,,,,0,,,,,T,terres,,,33834,-1.459914,47.724128
2019-695668,2019-11-05,000001,Vente,148000,5597,,LA PETITE SOUCHAIS,C312,44110,44153,Saint-Aubin-des-Châteaux,44,,,44153000YH0042,,,,,,,,,,,,,0,1,Maison,99,5,S,sols,,,1630,-1.491752,47.704961
2019-695668,2019-11-05,000001,Vente,148000,5597,,LA PETITE SOUCHAIS,C312,44110,44153,Saint-Aubin-des-Châteaux,44,,,44153000YH0042,,,,,,,,,,,,,0,1,Maison,99,5,BR,futaies résineuses,,,8300,-1.491752,47.704961
2019-695681,2019-11-12,000001,Echange,100,,,LES JAUNAIS,B947,44110,44153,Saint-Aubin-des-Châteaux,44,,,44153000ZD0294,,,,,,,,,,,,,0,,,,,T,terres,,,171,-1.490221,47.726144
2019-695681,2019-11-12,000002,Echange,100,,,MAUNY,C174,44110,44153,Saint-Aubin-des-Châteaux,44,,,44153000ZD0292,,,,,,,,,,,,,0,,,,,S,sols,,,74,-1.485765,47.724885
2019-695723,2019-11-20,000001,Vente,20000,,,LES COUDRES,B544,44110,44153,Saint-Aubin-des-Châteaux,44,,,44153000ZH0213,,,,,,,,,,,,,0,,,,,BT,taillis simples,,,5482,-1.46038,47.728123
2019-695723,2019-11-20,000001,Vente,20000,,,LES COUDRES,B544,44110,44153,Saint-Aubin-des-Châteaux,44,,,44153000ZH0213,,,,,,,,,,,,,0,,,,,T,terres,,,3799,-1.46038,47.728123
2019-695778,2019-11-06,000001,Vente,85000,17,,RUE DE LA VIGNE,0670,44110,44153,Saint-Aubin-des-Châteaux,44,,,44153000ZD0055,,,,,,,,,,,,,0,1,Maison,128,4,S,sols,,,1730,-1.490716,47.723074
2019-695778,2019-11-06,000001,Vente,85000,17,,RUE DE LA VIGNE,0670,44110,44153,Saint-Aubin-des-Châteaux,44,,,44153000ZD0055,,,,,,,,,,,,,0,1,Maison,128,4,J,jardins,,,285,-1.490716,47.723074
2019-695790,2019-11-08,000001,Vente,83500,7,,RUE DU TERTRE,0666,44110,44153,Saint-Aubin-des-Châteaux,44,,,44153000AB0059,,,,,,,,,,,,,0,4,Local industriel. commercial ou assimilé,50,0,S,sols,,,72,-1.484149,47.719118
2019-695790,2019-11-08,000001,Vente,83500,7,,RUE DU TERTRE,0666,44110,44153,Saint-Aubin-des-Châteaux,44,,,44153000AB0059,,,,,,,,,,,,,0,1,Maison,93,4,S,sols,,,72,-1.484149,47.719118
2019-695790,2019-11-08,000001,Vente,83500,,,LE BOURG LE TERTRE,B156,44110,44153,Saint-Aubin-des-Châteaux,44,,,44153000AB0060,,,,,,,,,,,,,0,,,,,S,sols,,,305,-1.484016,47.719288
2019-695790,2019-11-08,000001,Vente,83500,,,LE BOURG,B151,44110,44153,Saint-Aubin-des-Châteaux,44,,,44153000AB0061,,,,,,,,,,,,,0,,,,,S,sols,,,45,-1.483885,47.719416
2019-695790,2019-11-08,000001,Vente,83500,,,LE BOURG,B151,44110,44153,Saint-Aubin-des-Châteaux,44,,,44153000AB0243,,,,,,,,,,,,,0,,,,,S,sols,,,43,-1.484169,47.719194
2019-695790,2019-11-08,000001,Vente,83500,,,LE BOURG,B151,44110,44153,Saint-Aubin-des-Châteaux,44,,,44153000AB0369,,,,,,,,,,,,,0,,,,,S,sols,,,5,-1.484134,47.719218
2019-695809,2019-11-27,000001,Vente,1,,,LA POBLAIS,C375,44110,44153,Saint-Aubin-des-Châteaux,44,,,44153000ZM0085,,,,,,,,,,,,,0,,,,,S,sols,,,54,-1.483874,47.70759
2019-695905,2019-12-09,000001,Vente,255000,9,,IMP DES TEMPLIERS,0664,44110,44153,Saint-Aubin-des-Châteaux,44,,,44153000AB0357,,,5,,9,48.34,,,,,,,2,2,Appartement,52,2,,,,,,-1.484729,47.718582
2019-695905,2019-12-09,000001,Vente,255000,9,,IMP DES TEMPLIERS,0664,44110,44153,Saint-Aubin-des-Châteaux,44,,,44153000AB0357,,,3,,7,43.36,,,,,,,2,2,Appartement,47,2,,,,,,-1.484729,47.718582
2019-695905,2019-12-09,000001,Vente,255000,9,,IMP DES TEMPLIERS,0664,44110,44153,Saint-Aubin-des-Châteaux,44,,,44153000AB0357,,,4,,8,60.82,,,,,,,2,2,Appartement,61,3,,,,,,-1.484729,47.718582
2019-695905,2019-12-09,000001,Vente,255000,9,,IMP DES TEMPLIERS,0664,44110,44153,Saint-Aubin-des-Châteaux,44,,,44153000AB0357,,,10,79.51,6,,,,,,,,2,2,Appartement,82,4,,,,,,-1.484729,47.718582
2019-695905,2019-12-09,000001,Vente,255000,9,,IMP DES TEMPLIERS,0664,44110,44153,Saint-Aubin-des-Châteaux,44,,,44153000AB0357,,,1,,2,59.77,,,,,,,2,2,Appartement,56,3,,,,,,-1.484729,47.718582
2019-696001,2019-12-19,000001,Vente,60000,,,LE TERTRE,C842,44110,44153,Saint-Aubin-des-Châteaux,44,,,44153000YH0002,,,,,,,,,,,,,0,,,,,BF,futaies feuillues,,,8742,-1.497655,47.709236
2019-696001,2019-12-19,000001,Vente,60000,,,LE TERTRE,C842,44110,44153,Saint-Aubin-des-Châteaux,44,,,44153000YH0005,,,,,,,,,,,,,0,,,,,BF,futaies feuillues,,,57927,-1.492301,47.709745
2019-696031,2019-12-20,000001,Vente,60000,11,,RUE DU TERTRE,0666,44110,44153,Saint-Aubin-des-Châteaux,44,,,44153000AB0370,,,,,,,,,,,,,0,1,Maison,54,2,S,sols,,,167,-1.483916,47.719035
2019-696093,2019-12-27,000001,Vente,15000,,,LA GUILLAUMIERE,B855,44110,44153,Saint-Aubin-des-Châteaux,44,,,44153000ZR0025,,,,,,,,,,,,,0,,,,,AG,terrains d'agrément,,,4414,-1.428601,47.70788
