id_mutation,date_mutation,numero_disposition,nature_mutation,valeur_fonciere,adresse_numero,adresse_suffixe,adresse_nom_voie,adresse_code_voie,code_postal,code_commune,nom_commune,code_departement,ancien_code_commune,ancien_nom_commune,id_parcelle,ancien_id_parcelle,numero_volume,lot1_numero,lot1_surface_carrez,lot2_numero,lot2_surface_carrez,lot3_numero,lot3_surface_carrez,lot4_numero,lot4_surface_carrez,lot5_numero,lot5_surface_carrez,nombre_lots,code_type_local,type_local,surface_reelle_bati,nombre_pieces_principales,code_nature_culture,nature_culture,code_nature_culture_speciale,nature_culture_speciale,surface_terrain,longitude,latitude
2019-708708,2019-01-18,000001,Vente,113000,46,,RUE DES ACACIAS,0024,45300,45133,Engenville,45,,,451330000E0051,,,,,,,,,,,,,0,1,Maison,120,6,S,sols,,,982,2.250155,48.238419
2019-708708,2019-01-18,000001,Vente,113000,,,LE BOURG,B003,45300,45133,Engenville,45,,,451330000E0361,,,,,,,,,,,,,0,,,,,S,sols,,,69,2.250127,48.238521
2019-708708,2019-01-18,000001,Vente,113000,,,LE COLOMBIER,B021,45300,45133,Engenville,45,,,45133000ZE0124,,,,,,,,,,,,,0,,,,,T,terres,,,1653,2.250302,48.238305
2019-708844,2019-02-15,000001,Vente,4000,,,LE BUISSON RIGAULT,B007,45300,45133,Engenville,45,,,45133000ZS0005,,,,,,,,,,,,,0,,,,,T,terres,,,3060,2.246712,48.240142
2019-708856,2019-03-01,000001,Vente,118000,19,,RUE DU CROC AU LIEVRE,0021,45300,45133,Engenville,45,,,451330000E0148,,,,,,,,,,,,,0,1,Maison,86,4,S,sols,,,499,2.245437,48.23862
2019-708856,2019-03-01,000001,Vente,118000,,,LE BOURG,B003,45300,45133,Engenville,45,,,451330000E0150,,,,,,,,,,,,,0,,,,,J,jardins,POTAG,Jardin potager,527,2.244708,48.238693
2019-708979,2019-04-03,000001,Vente,163500,,,LE BOURG,B003,45300,45133,Engenville,45,,,451330000E0425,,,,,,,,,,,,,0,,,,,S,sols,,,133,,
2019-708979,2019-04-03,000001,Vente,163500,,,LE BOURG,B003,45300,45133,Engenville,45,,,451330000E0426,,,,,,,,,,,,,0,,,,,S,sols,,,15,,
2019-708979,2019-04-03,000001,Vente,163500,,,RUE DU MOULIN,0026,45300,45133,Engenville,45,,,451330000E0427,,,,,,,,,,,,,0,,,,,T,terres,,,278,,
2019-708979,2019-04-03,000001,Vente,163500,,,RUE DU MOULIN,0026,45300,45133,Engenville,45,,,451330000E0428,,,,,,,,,,,,,0,,,,,T,terres,,,1,,
2019-708979,2019-04-03,000001,Vente,163500,,,RUE DU MOULIN,0026,45300,45133,Engenville,45,,,451330000E0429,,,,,,,,,,,,,0,,,,,T,terres,,,652,,
2019-708979,2019-04-03,000001,Vente,163500,,,RUE DU MOULIN,0026,45300,45133,Engenville,45,,,451330000E0430,,,,,,,,,,,,,0,,,,,T,terres,,,1003,2.244177,48.237522
2019-708979,2019-04-03,000001,Vente,163500,,,RUE DU MOULIN,0026,45300,45133,Engenville,45,,,451330000E0431,,,,,,,,,,,,,0,,,,,T,terres,,,413,2.244076,48.237321
2019-708979,2019-04-03,000001,Vente,163500,4,B,RUE DU MOULIN,0026,45300,45133,Engenville,45,,,451330000E0432,,,,,,,,,,,,,0,1,Maison,128,5,S,sols,,,39,2.244965,48.237509
2019-708979,2019-04-03,000001,Vente,163500,4,B,RUE DU MOULIN,0026,45300,45133,Engenville,45,,,451330000E0432,,,,,,,,,,,,,0,1,Maison,133,4,S,sols,,,39,2.244965,48.237509
2019-708979,2019-04-03,000001,Vente,163500,,,LE BUISSON RIGAULT,B007,45300,45133,Engenville,45,,,451330000E0433,,,,,,,,,,,,,0,,,,,S,sols,,,374,,
2019-708979,2019-04-03,000001,Vente,163500,,,RUE DU MOULIN,0026,45300,45133,Engenville,45,,,451330000E0434,,,,,,,,,,,,,0,,,,,S,sols,,,63,2.244714,48.237413
2019-708979,2019-04-03,000001,Vente,163500,,,RUE DU MOULIN,0026,45300,45133,Engenville,45,,,451330000E0435,,,,,,,,,,,,,0,,,,,S,sols,,,3,,
2019-709106,2019-05-14,000001,Vente,184000,23,,RUE DU CROC AU LIEVRE,0021,45300,45133,Engenville,45,,,451330000E0393,,,,,,,,,,,,,0,1,Maison,101,5,S,sols,,,500,2.244909,48.238978
2019-709106,2019-05-14,000001,Vente,184000,23,,RUE DU CROC AU LIEVRE,0021,45300,45133,Engenville,45,,,451330000E0393,,,,,,,,,,,,,0,1,Maison,101,5,J,jardins,POTAG,Jardin potager,730,2.244909,48.238978
2019-709184,2019-05-20,000001,Vente,25000,,,RUE DU MOULIN,0026,45300,45133,Engenville,45,,,451330000E0431,,,,,,,,,,,,,0,,,,,AB,terrains a bâtir,,,413,2.244076,48.237321
2019-709189,2019-05-29,000001,Vente,135000,11,,RUE DE ST SAMSON,0023,45300,45133,Engenville,45,,,451330000H0646,,,,,,,,,,,,,0,1,Maison,120,3,S,sols,,,914,2.220006,48.225841
2019-709403,2019-07-23,000001,Vente,245000,7,,RUE DE ST SAMSON,0023,45300,45133,Engenville,45,,,451330000H0534,,,,,,,,,,,,,0,1,Maison,185,4,S,sols,,,1625,2.219593,48.226247
2019-709403,2019-07-23,000001,Vente,245000,7,,RUE DE ST SAMSON,0023,45300,45133,Engenville,45,,,451330000H0541,,,,,,,,,,,,,0,3,Dépendance,,0,J,jardins,POTAG,Jardin potager,614,2.220026,48.226673
2019-709665,2019-10-14,000001,Vente,150000,,,MONTVILLE,B046,45300,45133,Engenville,45,,,451330000B0069,,,,,,,,,,,,,0,,,,,J,jardins,POTAG,Jardin potager,710,2.240283,48.254197
2019-709665,2019-10-14,000001,Vente,150000,8,,MONTVILLE,B046,45300,45133,Engenville,45,,,451330000B0070,,,,,,,,,,,,,0,1,Maison,81,3,S,sols,,,1100,2.240138,48.254045
2019-709665,2019-10-14,000001,Vente,150000,,,MONTVILLE,B046,45300,45133,Engenville,45,,,451330000B0071,,,,,,,,,,,,,0,,,,,S,sols,,,2865,2.239691,48.254192
2019-709669,2019-10-09,000001,Vente,85000,15,,RUE DES ACACIAS,0024,45300,45133,Engenville,45,,,451330000E0030,,,,,,,,,,,,,0,1,Maison,40,1,S,sols,,,148,2.247932,48.238442
2019-709847,2019-11-19,000001,Vente,155000,6,B,RUE DU CROC AU LIEVRE,0021,45300,45133,Engenville,45,,,451330000E0420,,,,,,,,,,,,,0,1,Maison,176,6,S,sols,,,435,2.246017,48.238707
2019-709847,2019-11-19,000001,Vente,155000,6,B,RUE DU CROC AU LIEVRE,0021,45300,45133,Engenville,45,,,451330000E0420,,,,,,,,,,,,,0,1,Maison,37,2,S,sols,,,435,2.246017,48.238707
2019-709895,2019-11-21,000001,Vente,40337.6,,,EZERVILLE,B032,45300,45133,Engenville,45,,,45133000ZL0161,,,,,,,,,,,,,0,,,,,T,terres,,,3768,2.220643,48.225088
2019-709895,2019-11-21,000001,Vente,40337.6,,,EZERVILLE,B032,45300,45133,Engenville,45,,,45133000ZL0162,,,,,,,,,,,,,0,,,,,T,terres,,,2414,2.220581,48.224946
2019-709895,2019-11-21,000001,Vente,40337.6,,,LES GROUETTES,B038,45300,45133,Engenville,45,,,45133000ZN0039,,,,,,,,,,,,,0,,,,,T,terres,,,6170,2.217419,48.228462
2019-709895,2019-11-21,000001,Vente,40337.6,,,LES GROUETTES,B038,45300,45133,Engenville,45,,,45133000ZN0039,,,,,,,,,,,,,0,,,,,T,terres,,,12340,2.217419,48.228462
2019-709895,2019-11-21,000001,Vente,40337.6,,,LA JUSTICE,B040,45300,45133,Engenville,45,,,45133000ZP0011,,,,,,,,,,,,,0,,,,,T,terres,,,25730,2.21694,48.234877
