id_mutation,date_mutation,numero_disposition,nature_mutation,valeur_fonciere,adresse_numero,adresse_suffixe,adresse_nom_voie,adresse_code_voie,code_postal,code_commune,nom_commune,code_departement,ancien_code_commune,ancien_nom_commune,id_parcelle,ancien_id_parcelle,numero_volume,lot1_numero,lot1_surface_carrez,lot2_numero,lot2_surface_carrez,lot3_numero,lot3_surface_carrez,lot4_numero,lot4_surface_carrez,lot5_numero,lot5_surface_carrez,nombre_lots,code_type_local,type_local,surface_reelle_bati,nombre_pieces_principales,code_nature_culture,nature_culture,code_nature_culture_speciale,nature_culture_speciale,surface_terrain,longitude,latitude
2019-708728,2019-01-25,000001,Vente,3000,,,LES OUCHES OUEST,B039,45480,45135,Erceville,45,,,45135000ZL0017,,,,,,,,,,,,,0,,,,,T,terres,,,310,2.033239,48.235999
2019-708728,2019-01-25,000001,Vente,3000,,,LES OUCHES OUEST,B039,45480,45135,Erceville,45,,,45135000ZL0017,,,,,,,,,,,,,0,,,,,AB,terrains a bâtir,,,2500,2.033239,48.235999
2019-709019,2019-04-11,000001,Vente,20918,,,PIECES DU CARREFOUR,B042,45480,45135,Erceville,45,,,45135000ZK0023,,,,,,,,,,,,,0,,,,,T,terres,,,4633,2.045064,48.246825
2019-709019,2019-04-11,000001,Vente,20918,,,PIECES DU CARREFOUR,B042,45480,45135,Erceville,45,,,45135000ZK0023,,,,,,,,,,,,,0,,,,,T,terres,,,2317,2.045064,48.246825
2019-709019,2019-04-11,000001,Vente,20918,,,CHEMIN DE TREMEVILLE,B021,45480,45135,Erceville,45,,,45135000ZK0069,,,,,,,,,,,,,0,,,,,T,terres,,,2388,2.03914,48.2422
2019-709019,2019-04-11,000001,Vente,20918,,,CHEMIN DE TREMEVILLE,B021,45480,45135,Erceville,45,,,45135000ZK0069,,,,,,,,,,,,,0,,,,,T,terres,,,2388,2.03914,48.2422
2019-709019,2019-04-11,000001,Vente,20918,,,LA BESACE,B004,45480,45135,Erceville,45,,,45135000ZM0007,,,,,,,,,,,,,0,,,,,T,terres,,,24030,2.021376,48.232285
2019-709062,2019-04-19,000001,Vente,293000,,,LE BOURG,B012,45480,45135,Erceville,45,,,451350000A0193,,,,,,,,,,,,,0,,,,,J,jardins,,,720,2.035909,48.238167
2019-709062,2019-04-19,000001,Vente,293000,16,,GR GRANDE RUE,0055,45480,45135,Erceville,45,,,451350000A0194,,,,,,,,,,,,,0,1,Maison,224,6,S,sols,,,645,2.035902,48.238349
2019-709161,2019-05-29,000001,Vente,231467,10,,RUE DU MOULIN,0060,45480,45135,Erceville,45,,,451350000A0509,,,,,,,,,,,,,0,1,Maison,95,5,S,sols,,,381,2.034107,48.239435
2019-709161,2019-05-29,000001,Vente,231467,,,RUE DU MOULIN,0060,45480,45135,Erceville,45,,,451350000A0512,,,,,,,,,,,,,0,,,,,S,sols,,,24,2.034114,48.239504
2019-709161,2019-05-29,000001,Vente,231467,,,RUE DU MOULIN,0060,45480,45135,Erceville,45,,,451350000A0514,,,,,,,,,,,,,0,,,,,AG,terrains d'agrément,,,545,2.034204,48.239563
2019-709186,2019-05-23,000001,Vente,12025,,,VALLEE DE L EPINETTE,B054,45480,45135,Erceville,45,,,45135000ZK0050,,,,,,,,,,,,,0,,,,,T,terres,,,20040,2.045941,48.240562
2019-709210,2019-06-11,000001,Vente,218500,6,,RUE DU PARC,0095,45480,45135,Erceville,45,,,451350000A0132,,,,,,,,,,,,,0,1,Maison,80,5,S,sols,,,582,2.035956,48.240718
2019-709535,2019-09-05,000001,Vente,85000,,,LE BOURG,B012,45480,45135,Erceville,45,,,451350000A0414,,,,,,,,,,,,,0,,,,,J,jardins,,,418,2.034901,48.236841
2019-709535,2019-09-05,000001,Vente,85000,,,LE BOURG,B012,45480,45135,Erceville,45,,,451350000A0415,,,,,,,,,,,,,0,,,,,S,sols,,,28,2.034837,48.236746
2019-709535,2019-09-05,000001,Vente,85000,24,,GR GRANDE RUE,0055,45480,45135,Erceville,45,,,451350000A0418,,,,,,,,,,,,,0,1,Maison,67,4,S,sols,,,509,2.035238,48.236863
2019-709535,2019-09-05,000001,Vente,85000,,,LE BOURG,B012,45480,45135,Erceville,45,,,451350000A0501,,,,,,,,,,,,,0,,,,,J,jardins,,,409,2.034573,48.236783
2019-709535,2019-09-05,000001,Vente,85000,,,GR GRANDE RUE,0055,45480,45135,Erceville,45,,,451350000A0522,,,,,,,,,,,,,0,,,,,S,sols,,,45,2.035207,48.236779
2019-709746,2019-10-31,000001,Vente,60000,11,,RUE DU PARC,0095,45480,45135,Erceville,45,,,451350000A0105,,,,,,,,,,,,,0,1,Maison,60,4,S,sols,,,527,2.035526,48.240587
2019-709829,2019-11-22,000001,Vente,35000,,,LE BOURG,B012,45480,45135,Erceville,45,,,451350000A0112,,,,,,,,,,,,,0,,,,,S,sols,,,535,2.035879,48.240364
2019-709889,2019-12-04,000001,Vente,220000,1,,RUE DU MOULIN,0060,45480,45135,Erceville,45,,,451350000A0200,,,,,,,,,,,,,0,1,Maison,145,4,S,sols,,,435,2.035693,48.239042
2019-709941,2019-11-29,000001,Vente,135000,6,,RUE DE LA GARENNE,0050,45480,45135,Erceville,45,,,451350000A0151,,,,,,,,,,,,,0,1,Maison,90,4,S,sols,,,434,2.037244,48.240926
2019-709941,2019-11-29,000001,Vente,135000,,,LE BOURG,B012,45480,45135,Erceville,45,,,451350000A0152,,,,,,,,,,,,,0,,,,,J,jardins,,,592,2.037427,48.240909
