id_mutation,date_mutation,numero_disposition,nature_mutation,valeur_fonciere,adresse_numero,adresse_suffixe,adresse_nom_voie,adresse_code_voie,code_postal,code_commune,nom_commune,code_departement,ancien_code_commune,ancien_nom_commune,id_parcelle,ancien_id_parcelle,numero_volume,lot1_numero,lot1_surface_carrez,lot2_numero,lot2_surface_carrez,lot3_numero,lot3_surface_carrez,lot4_numero,lot4_surface_carrez,lot5_numero,lot5_surface_carrez,nombre_lots,code_type_local,type_local,surface_reelle_bati,nombre_pieces_principales,code_nature_culture,nature_culture,code_nature_culture_speciale,nature_culture_speciale,surface_terrain,longitude,latitude
2019-711481,2019-01-15,000001,Vente,1000,,,COMBEL BRU,B045,46350,46236,Reilhaguet,46,,,462360000C0287,,,,,,,,,,,,,0,,,,,T,terres,,,835,1.50468,44.783525
2019-711481,2019-01-15,000001,Vente,1000,,,COMBEL BRU,B045,46350,46236,Reilhaguet,46,,,462360000C0288,,,,,,,,,,,,,0,,,,,L,landes,,,1210,1.504761,44.783452
2019-712001,2019-02-13,000001,Vente,135000,,,REILHAGUET,B144,46350,46236,Reilhaguet,46,,,46236000AB0043,,,,,,,,,,,,,0,,,,,J,jardins,POTAG,Jardin potager,375,1.504864,44.77089
2019-712001,2019-02-13,000001,Vente,135000,5033,,REILHAGUET,B144,46350,46236,Reilhaguet,46,,,46236000AB0050,,,,,,,,,,,,,0,1,Maison,122,5,S,sols,,,805,1.504662,44.770961
2019-712001,2019-02-13,000001,Vente,135000,,,REILHAGUET,B144,46350,46236,Reilhaguet,46,,,46236000AB0051,,,,,,,,,,,,,0,,,,,P,prés,,,1090,1.504666,44.771227
2019-713560,2019-06-18,000001,Vente,40000,5519,F,LES ESTOURNELS,B085,46350,46236,Reilhaguet,46,,,462360000A0519,,,,,,,,,,,,,0,3,Dépendance,,0,AB,terrains a bâtir,,,500,1.501313,44.789589
2019-713560,2019-06-18,000001,Vente,40000,5519,F,LES ESTOURNELS,B085,46350,46236,Reilhaguet,46,,,462360000A0519,,,,,,,,,,,,,0,3,Dépendance,,0,P,prés,,,3030,1.501313,44.789589
2019-715211,2019-10-04,000001,Vente,19000,,,CLOS DE CAMBRET,B037,46350,46236,Reilhaguet,46,,,462360000E1000,,,,,,,,,,,,,0,,,,,AB,terrains a bâtir,,,2039,1.499814,44.767502
2019-716414,2019-12-20,000001,Vente,37100,,,LES DOUMENJOUX,B081,46350,46236,Reilhaguet,46,,,462360000A0112,,,,,,,,,,,,,0,,,,,L,landes,,,7330,1.491704,44.788197
2019-716414,2019-12-20,000001,Vente,37100,,,LES DOUMENJOUX,B081,46350,46236,Reilhaguet,46,,,462360000A0113,,,,,,,,,,,,,0,,,,,L,landes,,,795,1.491099,44.787828
2019-716414,2019-12-20,000001,Vente,37100,,,LES DOUMENJOUX,B081,46350,46236,Reilhaguet,46,,,462360000A0114,,,,,,,,,,,,,0,,,,,L,landes,,,616,1.491547,44.787623
2019-716414,2019-12-20,000001,Vente,37100,,,LES DOUMENJOUX,B081,46350,46236,Reilhaguet,46,,,462360000A0115,,,,,,,,,,,,,0,,,,,T,terres,,,5960,1.492021,44.787832
2019-716414,2019-12-20,000001,Vente,37100,,,LES DOUMENJOUX,B081,46350,46236,Reilhaguet,46,,,462360000A0117,,,,,,,,,,,,,0,,,,,L,landes,,,3645,1.492431,44.787464
2019-716414,2019-12-20,000001,Vente,37100,,,LES DOUMENJOUX,B081,46350,46236,Reilhaguet,46,,,462360000A0118,,,,,,,,,,,,,0,,,,,L,landes,,,2328,1.492789,44.787212
2019-716414,2019-12-20,000001,Vente,37100,,,LES GRANGES,B098,46350,46236,Reilhaguet,46,,,462360000A0119,,,,,,,,,,,,,0,,,,,T,terres,,,1360,1.49262,44.786838
2019-716414,2019-12-20,000001,Vente,37100,,,LES GRANGES,B098,46350,46236,Reilhaguet,46,,,462360000A0119,,,,,,,,,,,,,0,,,,,AB,terrains a bâtir,,,1000,1.49262,44.786838
