id_mutation,date_mutation,numero_disposition,nature_mutation,valeur_fonciere,adresse_numero,adresse_suffixe,adresse_nom_voie,adresse_code_voie,code_postal,code_commune,nom_commune,code_departement,ancien_code_commune,ancien_nom_commune,id_parcelle,ancien_id_parcelle,numero_volume,lot1_numero,lot1_surface_carrez,lot2_numero,lot2_surface_carrez,lot3_numero,lot3_surface_carrez,lot4_numero,lot4_surface_carrez,lot5_numero,lot5_surface_carrez,nombre_lots,code_type_local,type_local,surface_reelle_bati,nombre_pieces_principales,code_nature_culture,nature_culture,code_nature_culture_speciale,nature_culture_speciale,surface_terrain,longitude,latitude
2019-711705,2019-01-29,000001,Vente,800,,,LES PLAINES,B083,46300,46308,Soucirac,46,,,463080000A0544,,,,,,,,,,,,,0,,,,,T,terres,,,7760,1.490413,44.704721
2019-711705,2019-01-29,000001,Vente,800,,,LES PLAINES,B083,46300,46308,Soucirac,46,,,463080000A0544,,,,,,,,,,,,,0,,,,,S,sols,,,810,1.490413,44.704721
2019-711897,2019-02-22,000001,Vente,343850,,,LA GREZE,B058,46300,46308,Soucirac,46,,,463080000B0321,,,,,,,,,,,,,0,,,,,J,jardins,POTAG,Jardin potager,690,1.515577,44.708219
2019-711897,2019-02-22,000001,Vente,343850,5073,,LA GREZE,B058,46300,46308,Soucirac,46,,,463080000B0699,,,,,,,,,,,,,0,1,Maison,170,6,S,sols,,,1719,1.515167,44.708453
2019-711897,2019-02-22,000001,Vente,343850,,,LA GREZE,B058,46300,46308,Soucirac,46,,,463080000B0700,,,,,,,,,,,,,0,,,,,T,terres,,,71,1.514941,44.708363
2019-711897,2019-02-22,000001,Vente,343850,,,LA GREZE,B058,46300,46308,Soucirac,46,,,463080000B0706,,,,,,,,,,,,,0,,,,,T,terres,,,189,1.515101,44.70811
2019-711897,2019-02-22,000001,Vente,343850,,,LA GREZE,B058,46300,46308,Soucirac,46,,,463080000B0707,,,,,,,,,,,,,0,,,,,T,terres,,,2097,1.514733,44.708377
2019-711897,2019-02-22,000001,Vente,343850,,,LA GREZE,B058,46300,46308,Soucirac,46,,,463080000B0751,,,,,,,,,,,,,0,,,,,S,sols,,,330,1.515169,44.70819
2019-711897,2019-02-22,000001,Vente,343850,,,LA GREZE,B058,46300,46308,Soucirac,46,,,463080000B0752,,,,,,,,,,,,,0,,,,,T,terres,,,165,1.515271,44.708067
2019-712090,2019-02-20,000001,Vente,15000,5037,,LE BOURG,B004,46300,46308,Soucirac,46,,,463080000A0062,,,,,,,,,,,,,0,1,Maison,35,1,S,sols,,,95,1.502093,44.70199
2019-712090,2019-02-20,000001,Vente,15000,,,LES COMBES ET ESCARBALS,B042,46300,46308,Soucirac,46,,,463080000A0427,,,,,,,,,,,,,0,,,,,T,terres,,,2140,1.501091,44.701734
2019-712090,2019-02-20,000001,Vente,15000,,,LES COMBES ET ESCARBALS,B042,46300,46308,Soucirac,46,,,463080000A0428,,,,,,,,,,,,,0,,,,,VI,vignes,,,700,1.501255,44.701939
2019-712090,2019-02-20,000001,Vente,15000,,,LES COMBES ET ESCARBALS,B042,46300,46308,Soucirac,46,,,463080000A0430,,,,,,,,,,,,,0,,,,,T,terres,,,1380,1.501532,44.702338
2019-712090,2019-02-20,000001,Vente,15000,,,LES COMBES ET ESCARBALS,B042,46300,46308,Soucirac,46,,,463080000A0432,,,,,,,,,,,,,0,,,,,J,jardins,POTAG,Jardin potager,590,1.501954,44.702087
2019-713499,2019-06-17,000001,Vente,20000,,,VITAREL,B104,46300,46308,Soucirac,46,,,463080000B0518,,,,,,,,,,,,,0,,,,,L,landes,,,975,1.509272,44.698441
2019-713499,2019-06-17,000001,Vente,20000,,,VITAREL,B104,46300,46308,Soucirac,46,,,463080000B0520,,,,,,,,,,,,,0,,,,,L,landes,,,965,1.508724,44.698278
2019-713499,2019-06-17,000001,Vente,20000,,,COMBELS DE BARDES,B041,46300,46308,Soucirac,46,,,463080000B0521,,,,,,,,,,,,,0,,,,,T,terres,,,2500,1.508789,44.698058
2019-713499,2019-06-17,000001,Vente,20000,,,VITAREL,B104,46300,46308,Soucirac,46,,,463080000B0523,,,,,,,,,,,,,0,,,,,T,terres,,,12640,1.508643,44.697426
2019-713499,2019-06-17,000001,Vente,20000,,,VITAREL,B104,46300,46308,Soucirac,46,,,463080000B0531,,,,,,,,,,,,,0,,,,,BT,taillis simples,,,16840,1.510047,44.696418
2019-713499,2019-06-17,000001,Vente,20000,,,VITAREL,B104,46300,46308,Soucirac,46,,,463080000B0533,,,,,,,,,,,,,0,,,,,T,terres,,,13965,1.509814,44.697794
2019-713500,2019-06-17,000001,Vente,12000,,,LES TOURONS,B097,46300,46308,Soucirac,46,,,463080000B0486,,,,,,,,,,,,,0,,,,,P,prés,,,1040,1.503604,44.700342
2019-713500,2019-06-17,000001,Vente,12000,5104,F,LES TOURONS,B097,46300,46308,Soucirac,46,,,463080000B0494,,,,,,,,,,,,,0,4,Local industriel. commercial ou assimilé,4,0,T,terres,,,8015,1.502246,44.699599
2019-713500,2019-06-17,000001,Vente,12000,5104,F,LES TOURONS,B097,46300,46308,Soucirac,46,,,463080000B0494,,,,,,,,,,,,,0,4,Local industriel. commercial ou assimilé,4,0,S,sols,,,1000,1.502246,44.699599
2019-713500,2019-06-17,000001,Vente,12000,,,LES TOURONS,B097,46300,46308,Soucirac,46,,,463080000B0503,,,,,,,,,,,,,0,,,,,L,landes,,,9555,1.502683,44.699355
2019-713500,2019-06-17,000001,Vente,12000,,,LES TOURONS,B097,46300,46308,Soucirac,46,,,463080000B0505,,,,,,,,,,,,,0,,,,,P,prés,,,755,1.503003,44.699877
2019-713500,2019-06-17,000001,Vente,12000,,,LES TOURONS,B097,46300,46308,Soucirac,46,,,463080000B0506,,,,,,,,,,,,,0,,,,,P,prés,,,2600,1.503321,44.699921
2019-713500,2019-06-17,000001,Vente,12000,,,LES TOURONS,B097,46300,46308,Soucirac,46,,,463080000B0507,,,,,,,,,,,,,0,,,,,P,prés,,,1510,1.503454,44.699425
2019-713501,2019-06-17,000001,Vente,68000,,,LA ROQUE,B093,46300,46308,Soucirac,46,,,463080000A0250,,,,,,,,,,,,,0,,,,,L,landes,,,260,1.498896,44.699315
2019-713501,2019-06-17,000001,Vente,68000,,,LES COMBES ET ESCARBALS,B042,46300,46308,Soucirac,46,,,463080000A0433,,,,,,,,,,,,,0,,,,,J,jardins,POTAG,Jardin potager,225,1.501855,44.701877
2019-713501,2019-06-17,000001,Vente,68000,,,COMBELS DE BARDES,B041,46300,46308,Soucirac,46,,,463080000A0438,,,,,,,,,,,,,0,,,,,T,terres,,,980,1.500872,44.700775
2019-713501,2019-06-17,000001,Vente,68000,,,COMBELS DE BARDES,B041,46300,46308,Soucirac,46,,,463080000A0439,,,,,,,,,,,,,0,,,,,T,terres,,,4077,1.501485,44.700785
2019-713501,2019-06-17,000001,Vente,68000,,,COMBELS DE BARDES,B041,46300,46308,Soucirac,46,,,463080000A0439,,,,,,,,,,,,,0,,,,,T,terres,,,4078,1.501485,44.700785
2019-713501,2019-06-17,000001,Vente,68000,,,COMBELS DE BARDES,B041,46300,46308,Soucirac,46,,,463080000A0441,,,,,,,,,,,,,0,,,,,S,sols,,,145,1.502442,44.701006
2019-713501,2019-06-17,000001,Vente,68000,5039,A,COMBELS DE BARDES,B041,46300,46308,Soucirac,46,,,463080000A0442,,,,,,,,,,,,,0,1,Maison,68,2,S,sols,,,320,1.502387,44.700867
2019-713501,2019-06-17,000001,Vente,68000,,,COMBELS DE BARDES,B041,46300,46308,Soucirac,46,,,463080000A0443,,,,,,,,,,,,,0,,,,,T,terres,,,2570,1.502098,44.700653
2019-713501,2019-06-17,000001,Vente,68000,,,COMBELS DE BARDES,B041,46300,46308,Soucirac,46,,,463080000A0459,,,,,,,,,,,,,0,,,,,BT,taillis simples,,,1625,1.499612,44.699689
2019-713501,2019-06-17,000001,Vente,68000,,,COMBELS DE BARDES,B041,46300,46308,Soucirac,46,,,463080000A0460,,,,,,,,,,,,,0,,,,,T,terres,,,2275,1.499655,44.699869
2019-713501,2019-06-17,000001,Vente,68000,,,COMBELS DE BARDES,B041,46300,46308,Soucirac,46,,,463080000A0461,,,,,,,,,,,,,0,,,,,P,prés,,,1660,1.50035,44.700401
2019-713501,2019-06-17,000001,Vente,68000,,,COMBELS DE BARDES,B041,46300,46308,Soucirac,46,,,463080000A0462,,,,,,,,,,,,,0,,,,,L,landes,,,2850,1.50004,44.700647
2019-713501,2019-06-17,000001,Vente,68000,,,COMBELS DE BARDES,B041,46300,46308,Soucirac,46,,,463080000A0463,,,,,,,,,,,,,0,,,,,L,landes,,,2540,1.499352,44.700273
2019-713501,2019-06-17,000001,Vente,68000,,,COMBELS DE BARDES,B041,46300,46308,Soucirac,46,,,463080000A0464,,,,,,,,,,,,,0,,,,,L,landes,,,1320,1.499069,44.699839
2019-713501,2019-06-17,000001,Vente,68000,,,COMBELS DE BARDES,B041,46300,46308,Soucirac,46,,,463080000A0465,,,,,,,,,,,,,0,,,,,L,landes,,,630,1.498791,44.699733
2019-713501,2019-06-17,000001,Vente,68000,,,COMBELS DE BARDES,B041,46300,46308,Soucirac,46,,,463080000A1037,,,,,,,,,,,,,0,,,,,T,terres,,,172,1.502218,44.701057
2019-714236,2019-07-23,000001,Vente,2000,,,LES MEZOS,B076,46300,46308,Soucirac,46,,,463080000A0469,,,,,,,,,,,,,0,,,,,T,terres,,,6445,1.499391,44.70085
2019-714236,2019-07-23,000001,Vente,2000,,,LES MEZOS,B076,46300,46308,Soucirac,46,,,463080000A0471,,,,,,,,,,,,,0,,,,,T,terres,,,2990,1.499719,44.701771
2019-714236,2019-07-23,000001,Vente,2000,,,LES MEZOS,B076,46300,46308,Soucirac,46,,,463080000A0472,,,,,,,,,,,,,0,,,,,L,landes,,,4750,1.498996,44.702269
2019-714236,2019-07-23,000001,Vente,2000,,,LES MEZOS,B076,46300,46308,Soucirac,46,,,463080000A0473,,,,,,,,,,,,,0,,,,,L,landes,,,4480,1.498578,44.701872
2019-714236,2019-07-23,000001,Vente,2000,,,LES MEZOS,B076,46300,46308,Soucirac,46,,,463080000A0474,,,,,,,,,,,,,0,,,,,L,landes,,,4935,1.498812,44.701434
2019-714236,2019-07-23,000001,Vente,2000,,,LES MEZOS,B076,46300,46308,Soucirac,46,,,463080000A0475,,,,,,,,,,,,,0,,,,,BT,taillis simples,,,1020,1.498506,44.701009
2019-714255,2019-07-30,000001,Vente,120000,,,LE BOURG,B004,46300,46308,Soucirac,46,,,463080000A0098,,,,,,,,,,,,,0,,,,,S,sols,,,130,1.504471,44.702881
2019-714255,2019-07-30,000001,Vente,120000,5051,,LE BOURG,B004,46300,46308,Soucirac,46,,,463080000A0099,,,,,,,,,,,,,0,1,Maison,265,6,S,sols,,,220,1.504563,44.702882
2019-714956,2019-09-23,000001,Vente,2500,,,LA RAUZE,B090,46300,46308,Soucirac,46,,,463080000A0322,,,,,,,,,,,,,0,,,,,P,prés,,,3200,1.483107,44.695651
2019-714956,2019-09-23,000001,Vente,2500,,,LA RAUZE,B090,46300,46308,Soucirac,46,,,463080000A0323,,,,,,,,,,,,,0,,,,,P,prés,,,1765,1.482449,44.6961
2019-714956,2019-09-23,000001,Vente,2500,,,LA RAUZE,B090,46300,46308,Soucirac,46,,,463080000A0324,,,,,,,,,,,,,0,,,,,P,prés,,,3110,1.483035,44.696281
2019-714956,2019-09-23,000001,Vente,2500,,,LA RAUZE,B090,46300,46308,Soucirac,46,,,463080000A0325,,,,,,,,,,,,,0,,,,,P,prés,,,1700,1.482513,44.69657
2019-714956,2019-09-23,000001,Vente,2500,,,LA RAUZE,B090,46300,46308,Soucirac,46,,,463080000A0326,,,,,,,,,,,,,0,,,,,P,prés,,,705,1.482195,44.696419
2019-714956,2019-09-23,000001,Vente,2500,,,LA RAUZE,B090,46300,46308,Soucirac,46,,,463080000A0327,,,,,,,,,,,,,0,,,,,P,prés,,,730,1.48257,44.696789
2019-715298,2019-10-04,000001,Vente,114000,5112,F,CLAUZOUNELS,B029,46300,46308,Soucirac,46,,,463080000B0771,,,,,,,,,,,,,0,1,Maison,78,4,T,terres,,,905,1.506731,44.702067
2019-715298,2019-10-04,000001,Vente,114000,5112,F,CLAUZOUNELS,B029,46300,46308,Soucirac,46,,,463080000B0771,,,,,,,,,,,,,0,1,Maison,78,4,S,sols,,,500,1.506731,44.702067
2019-715298,2019-10-04,000001,Vente,114000,,,CLAUZOUNELS,B029,46300,46308,Soucirac,46,,,463080000B0773,,,,,,,,,,,,,0,,,,,T,terres,,,530,1.506542,44.701991
2019-715298,2019-10-04,000001,Vente,114000,,,CLAUZOUNELS,B029,46300,46308,Soucirac,46,,,463080000B0820,,,,,,,,,,,,,0,,,,,T,terres,,,2203,1.50704,44.702188
2019-715915,2019-11-29,000001,Vente,90000,5078,,LA GREZE,B058,46300,46308,Soucirac,46,,,463080000A1096,,,,,,,,,,,,,0,1,Maison,78,4,T,terres,,,2085,1.510723,44.713015
2019-715915,2019-11-29,000001,Vente,90000,5078,,LA GREZE,B058,46300,46308,Soucirac,46,,,463080000A1096,,,,,,,,,,,,,0,1,Maison,78,4,S,sols,,,500,1.510723,44.713015
