id_mutation,date_mutation,numero_disposition,nature_mutation,valeur_fonciere,adresse_numero,adresse_suffixe,adresse_nom_voie,adresse_code_voie,code_postal,code_commune,nom_commune,code_departement,ancien_code_commune,ancien_nom_commune,id_parcelle,ancien_id_parcelle,numero_volume,lot1_numero,lot1_surface_carrez,lot2_numero,lot2_surface_carrez,lot3_numero,lot3_surface_carrez,lot4_numero,lot4_surface_carrez,lot5_numero,lot5_surface_carrez,nombre_lots,code_type_local,type_local,surface_reelle_bati,nombre_pieces_principales,code_nature_culture,nature_culture,code_nature_culture_speciale,nature_culture_speciale,surface_terrain,longitude,latitude
2019-720662,2019-01-15,000001,Vente,9330,,,SAINT GERVAIS,B055,47800,47136,Laperche,47,,,471360000A0338,,,,,,,,,,,,,0,,,,,BT,taillis simples,,,9330,0.399779,44.555843
2019-720953,2019-03-14,000001,Vente,800,,,BOIS DE MOIRAX,B009,47800,47136,Laperche,47,,,471360000B0371,,,,,,,,,,,,,0,,,,,BT,taillis simples,,,1063,0.416754,44.544666
2019-721441,2019-05-31,000001,Vente,314980,52,,BORDENEUVE,B011,47800,47136,Laperche,47,,,471360000B0626,,,,,,,,,,,,,0,1,Maison,188,2,S,sols,,,2293,0.4079,44.531995
2019-721441,2019-05-31,000001,Vente,314980,,,BORDENEUVE,B011,47800,47136,Laperche,47,,,471360000B1111,,,,,,,,,,,,,0,,,,,T,terres,,,745,0.407695,44.532354
2019-721441,2019-05-31,000001,Vente,314980,,,BORDENEUVE,B011,47800,47136,Laperche,47,,,471360000B1113,,,,,,,,,,,,,0,,,,,S,sols,,,315,0.408358,44.531986
2019-721441,2019-05-31,000001,Vente,314980,,,BORDENEUVE,B011,47800,47136,Laperche,47,,,471360000B1113,,,,,,,,,,,,,0,,,,,T,terres,,,2185,0.408358,44.531986
2019-721441,2019-05-31,000001,Vente,314980,,,BORDENEUVE,B011,47800,47136,Laperche,47,,,471360000B1115,,,,,,,,,,,,,0,,,,,S,sols,,,1375,0.407952,44.531798
2019-721441,2019-05-31,000001,Vente,314980,,,BORDENEUVE,B011,47800,47136,Laperche,47,,,471360000B1117,,,,,,,,,,,,,0,,,,,T,terres,,,3879,0.408279,44.531628
2019-721441,2019-05-31,000001,Vente,314980,,,BORDENEUVE,B011,47800,47136,Laperche,47,,,471360000B1121,,,,,,,,,,,,,0,,,,,T,terres,,,1466,0.407924,44.531293
2019-721441,2019-05-31,000001,Vente,314980,,,BORDENEUVE,B011,47800,47136,Laperche,47,,,471360000B1163,,,,,,,,,,,,,0,,,,,S,sols,,,200,0.40747,44.531295
2019-721441,2019-05-31,000001,Vente,314980,,,BORDENEUVE,B011,47800,47136,Laperche,47,,,471360000B1164,,,,,,,,,,,,,0,,,,,S,sols,,,2432,0.407421,44.531605
2019-721648,2019-07-09,000001,Vente,5000,,,LANUSSE,B033,47800,47136,Laperche,47,,,471360000A0029,,,,,,,,,,,,,0,,,,,BT,taillis simples,,,2200,0.399901,44.561333
2019-721683,2019-07-17,000001,Vente,1956,,,TOURON,B056,47800,47136,Laperche,47,,,471360000A0615,,,,,,,,,,,,,0,,,,,BT,taillis simples,,,650,0.409153,44.546345
2019-721683,2019-07-17,000001,Vente,1956,,,FORET DE LAPERCHE,B021,47800,47136,Laperche,47,,,471360000A0634,,,,,,,,,,,,,0,,,,,BT,taillis simples,,,4939,0.410287,44.546422
2019-721685,2019-07-17,000001,Vente,229,,,GERARD,B024,47800,47136,Laperche,47,,,471360000A0224,,,,,,,,,,,,,0,,,,,BT,taillis simples,,,653,0.413256,44.553927
2019-721800,2019-08-02,000001,Vente,252000,,,LE BOURG,B012,47800,47136,Laperche,47,,,471360000A0340,,,,,,,,,,,,,0,,,,,L,landes,,,1089,0.418052,44.552603
2019-721800,2019-08-02,000001,Vente,252000,,,LE BOURG,B012,47800,47136,Laperche,47,,,471360000A0341,,,,,,,,,,,,,0,,,,,P,prés,,,2864,0.418156,44.552666
2019-721800,2019-08-02,000001,Vente,252000,,,LE BOURG,B012,47800,47136,Laperche,47,,,471360000A0349,,,,,,,,,,,,,0,,,,,S,sols,,,28,0.419225,44.552795
2019-721800,2019-08-02,000001,Vente,252000,,,LE BOURG,B012,47800,47136,Laperche,47,,,471360000A0350,,,,,,,,,,,,,0,,,,,J,jardins,POTAG,Jardin potager,1452,0.418945,44.55273
2019-721800,2019-08-02,000001,Vente,252000,23,A,LE BOURG,B012,47800,47136,Laperche,47,,,471360000A0351,,,,,,,,,,,,,0,1,Maison,120,4,S,sols,,,227,0.418804,44.552726
2019-721800,2019-08-02,000001,Vente,252000,,,LE BOURG,B012,47800,47136,Laperche,47,,,471360000A0352,,,,,,,,,,,,,0,,,,,P,prés,,,431,0.418697,44.552911
2019-721800,2019-08-02,000001,Vente,252000,,,LE BOURG,B012,47800,47136,Laperche,47,,,471360000A0980,,,,,,,,,,,,,0,,,,,S,sols,,,58,0.419182,44.552669
2019-722740,2019-09-26,000001,Adjudication,94000,,,BEAUPIED,B004,47800,47136,Laperche,47,,,471360000A0651,,,,,,,,,,,,,0,1,Maison,19,1,T,terres,,,32412,0.414034,44.550532
2019-722740,2019-09-26,000001,Adjudication,94000,,,BEAUPIED,B004,47800,47136,Laperche,47,,,471360000A0652,,,,,,,,,,,,,0,,,,,T,terres,,,10727,0.41495,44.551811
2019-722740,2019-09-26,000001,Adjudication,94000,9999,,BEAUPIED,B004,47800,47136,Laperche,47,,,471360000A0653,,,,,,,,,,,,,0,1,Maison,100,4,S,sols,,,2928,0.414257,44.552229
2019-722740,2019-09-26,000001,Adjudication,94000,,,BEAUPIED,B004,47800,47136,Laperche,47,,,471360000A0656,,,,,,,,,,,,,0,,,,,T,terres,,,8095,0.41513,44.553047
2019-722740,2019-09-26,000001,Adjudication,94000,,,BEAUPIED,B004,47800,47136,Laperche,47,,,471360000A0657,,,,,,,,,,,,,0,,,,,T,terres,,,9240,0.415774,44.55274
2019-722740,2019-09-26,000001,Adjudication,94000,,,BEAUPIED,B004,47800,47136,Laperche,47,,,471360000A0658,,,,,,,,,,,,,0,,,,,T,terres,,,13789,0.416624,44.552284
2019-722740,2019-09-26,000001,Adjudication,94000,,,MAUSSE,B036,47800,47136,Laperche,47,,,471360000A0671,,,,,,,,,,,,,0,,,,,L,landes,,,948,0.41428,44.549964
2019-722740,2019-09-26,000001,Adjudication,94000,,,BEAUPIED,B004,47800,47136,Laperche,47,,,471360000A0861,,,,,,,,,,,,,0,,,,,T,terres,,,17500,0.413266,44.552182
2019-722740,2019-09-26,000001,Adjudication,94000,,,BEAUPIED,B004,47800,47136,Laperche,47,,,471360000A0864,,,,,,,,,,,,,0,,,,,T,terres,,,4784,0.414467,44.553234
