id_mutation,date_mutation,numero_disposition,nature_mutation,valeur_fonciere,adresse_numero,adresse_suffixe,adresse_nom_voie,adresse_code_voie,code_postal,code_commune,nom_commune,code_departement,ancien_code_commune,ancien_nom_commune,id_parcelle,ancien_id_parcelle,numero_volume,lot1_numero,lot1_surface_carrez,lot2_numero,lot2_surface_carrez,lot3_numero,lot3_surface_carrez,lot4_numero,lot4_surface_carrez,lot5_numero,lot5_surface_carrez,nombre_lots,code_type_local,type_local,surface_reelle_bati,nombre_pieces_principales,code_nature_culture,nature_culture,code_nature_culture_speciale,nature_culture_speciale,surface_terrain,longitude,latitude
2019-720939,2019-03-04,000001,Vente,144000,,,SINCHOUX,B104,47410,47296,Ségalas,47,,,472960000D0531,,,,,,,,,,,,,0,,,,,BP,peupleraies,,,14535,0.524199,44.575512
2019-720939,2019-03-04,000001,Vente,144000,,,SINCHOUX,B104,47410,47296,Ségalas,47,,,472960000D0531,,,,,,,,,,,,,0,,,,,BF,futaies feuillues,,,2375,0.524199,44.575512
2019-720939,2019-03-04,000001,Vente,144000,,,SINCHOUX,B104,47410,47296,Ségalas,47,,,472960000D0534,,,,,,,,,,,,,0,,,,,T,terres,,,9250,0.526013,44.575655
2019-720939,2019-03-04,000001,Vente,144000,,,SINCHOUX,B104,47410,47296,Ségalas,47,,,472960000D0535,,,,,,,,,,,,,0,,,,,T,terres,,,500,0.526197,44.574723
2019-720939,2019-03-04,000001,Vente,144000,,,SINCHOUX,B104,47410,47296,Ségalas,47,,,472960000D0535,,,,,,,,,,,,,0,,,,,BF,futaies feuillues,,,10250,0.526197,44.574723
2019-720939,2019-03-04,000001,Vente,144000,,,SINCHOUX EST,B105,47410,47296,Ségalas,47,,,472960000D0537,,,,,,,,,,,,,0,,,,,BF,futaies feuillues,,,7000,0.524753,44.574917
2019-720939,2019-03-04,000001,Vente,144000,,,SINCHOUX EST,B105,47410,47296,Ségalas,47,,,472960000D0537,,,,,,,,,,,,,0,,,,,BP,peupleraies,,,6105,0.524753,44.574917
2019-720939,2019-03-04,000001,Vente,144000,65,,SINCHOUX,B104,47410,47296,Ségalas,47,,,472960000D0770,,,,,,,,,,,,,0,1,Maison,90,3,S,sols,,,3670,0.52532,44.575638
2019-721142,2019-04-25,000001,Vente,5000,,,ESCALETTE,B035,47410,47296,Ségalas,47,,,472960000E0201,,,,,,,,,,,,,0,,,,,BT,taillis simples,,,490,0.510229,44.596564
2019-721142,2019-04-25,000001,Vente,5000,,,BOIS DE BROUSSE,B007,47410,47296,Ségalas,47,,,472960000F0011,,,,,,,,,,,,,0,,,,,BT,taillis simples,,,2345,0.51159,44.605041
2019-721142,2019-04-25,000001,Vente,5000,,,MOULIN ROMPU,B076,47410,47296,Ségalas,47,,,472960000F0045,,,,,,,,,,,,,0,,,,,BT,taillis simples,,,1810,0.515762,44.603737
2019-721142,2019-04-25,000001,Vente,5000,,,BORDE NEUVE NORD,B014,47410,47296,Ségalas,47,,,472960000F0150,,,,,,,,,,,,,0,,,,,BT,taillis simples,,,3080,0.520259,44.599982
2019-721142,2019-04-25,000001,Vente,5000,,,JENAIS,B059,47410,47296,Ségalas,47,,,472960000F0177,,,,,,,,,,,,,0,,,,,BT,taillis simples,,,3220,0.519719,44.601305
2019-721142,2019-04-25,000001,Vente,5000,,,MOULIN ROMPU,B076,47410,47296,Ségalas,47,,,472960000F0272,,,,,,,,,,,,,0,,,,,BT,taillis simples,,,7359,0.513344,44.604819
2019-721196,2019-04-16,000001,Vente,55000,,,PRE DE LABEILLE,B097,47410,47296,Ségalas,47,,,472960000D0303,,,,,,,,,,,,,0,,,,,BP,peupleraies,,,3135,0.529187,44.572078
2019-721196,2019-04-16,000001,Vente,55000,,,PRE DE LABEILLE,B097,47410,47296,Ségalas,47,,,472960000D0304,,,,,,,,,,,,,0,,,,,BP,peupleraies,,,8404,0.528247,44.572
2019-721196,2019-04-16,000001,Vente,55000,,,SINCHOUX,B104,47410,47296,Ségalas,47,,,472960000D0529,,,,,,,,,,,,,0,,,,,BF,futaies feuillues,NOYER,Noyeraie ou noyers,17670,0.525823,44.576635
2019-721196,2019-04-16,000001,Vente,55000,,,SINCHOUX,B104,47410,47296,Ségalas,47,,,472960000D0530,,,,,,,,,,,,,0,,,,,E,eaux,LAC,Lac,4680,0.524339,44.576493
2019-721196,2019-04-16,000001,Vente,55000,,,SINCHOUX,B104,47410,47296,Ségalas,47,,,472960000D0536,,,,,,,,,,,,,0,,,,,BF,futaies feuillues,,,2500,0.525206,44.57429
2019-721196,2019-04-16,000001,Vente,55000,,,SINCHOUX,B104,47410,47296,Ségalas,47,,,472960000D0536,,,,,,,,,,,,,0,,,,,BP,peupleraies,,,2485,0.525206,44.57429
2019-721196,2019-04-16,000001,Vente,55000,,,SINCHOUX,B104,47410,47296,Ségalas,47,,,472960000D0538,,,,,,,,,,,,,0,,,,,BF,futaies feuillues,,,625,0.524241,44.57431
2019-721196,2019-04-16,000001,Vente,55000,,,SINCHOUX,B104,47410,47296,Ségalas,47,,,472960000D0538,,,,,,,,,,,,,0,,,,,BP,peupleraies,,,4060,0.524241,44.57431
2019-721196,2019-04-16,000001,Vente,55000,,,SINCHOUX,B104,47410,47296,Ségalas,47,,,472960000D0539,,,,,,,,,,,,,0,,,,,BP,peupleraies,,,8395,0.523318,44.573913
2019-721196,2019-04-16,000001,Vente,55000,,,SINCHOUX,B104,47410,47296,Ségalas,47,,,472960000D0540,,,,,,,,,,,,,0,,,,,BF,futaies feuillues,,,937,0.524788,44.573743
2019-721196,2019-04-16,000001,Vente,55000,,,SINCHOUX,B104,47410,47296,Ségalas,47,,,472960000D0540,,,,,,,,,,,,,0,,,,,BP,peupleraies,,,3435,0.524788,44.573743
2019-721196,2019-04-16,000001,Vente,55000,,,SINCHOUX,B104,47410,47296,Ségalas,47,,,472960000D0540,,,,,,,,,,,,,0,,,,,BF,futaies feuillues,,,748,0.524788,44.573743
2019-721196,2019-04-16,000001,Vente,55000,,,SINCHOUX,B104,47410,47296,Ségalas,47,,,472960000D0541,,,,,,,,,,,,,0,,,,,BR,futaies résineuses,,,3662,0.524689,44.573334
2019-721196,2019-04-16,000001,Vente,55000,,,SINCHOUX,B104,47410,47296,Ségalas,47,,,472960000D0542,,,,,,,,,,,,,0,,,,,BR,futaies résineuses,,,2788,0.525878,44.573415
2019-721196,2019-04-16,000001,Vente,55000,,,SINCHOUX,B104,47410,47296,Ségalas,47,,,472960000D0543,,,,,,,,,,,,,0,,,,,BP,peupleraies,,,1073,0.525689,44.573867
2019-721196,2019-04-16,000001,Vente,55000,,,SINCHOUX,B104,47410,47296,Ségalas,47,,,472960000D0543,,,,,,,,,,,,,0,,,,,BF,futaies feuillues,,,1812,0.525689,44.573867
2019-721196,2019-04-16,000001,Vente,55000,,,SINCHOUX,B104,47410,47296,Ségalas,47,,,472960000D0544,,,,,,,,,,,,,0,,,,,BP,peupleraies,,,700,0.525789,44.574234
2019-721196,2019-04-16,000001,Vente,55000,,,SINCHOUX,B104,47410,47296,Ségalas,47,,,472960000D0548,,,,,,,,,,,,,0,,,,,BT,taillis simples,,,2930,0.527413,44.572735
2019-721196,2019-04-16,000001,Vente,55000,,,SINCHOUX,B104,47410,47296,Ségalas,47,,,472960000D0593,,,,,,,,,,,,,0,,,,,BF,futaies feuillues,NOYER,Noyeraie ou noyers,3125,0.528302,44.575221
2019-721196,2019-04-16,000001,Vente,55000,,,SINCHOUX,B104,47410,47296,Ségalas,47,,,472960000D0593,,,,,,,,,,,,,0,,,,,BR,futaies résineuses,,,2982,0.528302,44.575221
2019-721196,2019-04-16,000001,Vente,55000,,,SINCHOUX,B104,47410,47296,Ségalas,47,,,472960000D0595,,,,,,,,,,,,,0,,,,,BF,futaies feuillues,NOYER,Noyeraie ou noyers,6000,0.529644,44.57517
2019-721196,2019-04-16,000001,Vente,55000,,,SINCHOUX,B104,47410,47296,Ségalas,47,,,472960000D0595,,,,,,,,,,,,,0,,,,,BP,peupleraies,,,3823,0.529644,44.57517
2019-721196,2019-04-16,000001,Vente,55000,,,SINCHOUX EST,B105,47410,47296,Ségalas,47,,,472960000D0768,,,,,,,,,,,,,0,,,,,BR,futaies résineuses,,,31830,0.525776,44.572367
2019-721196,2019-04-16,000001,Vente,55000,,,SINCHOUX EST,B105,47410,47296,Ségalas,47,,,472960000D0768,,,,,,,,,,,,,0,,,,,S,sols,,,200,0.525776,44.572367
2019-721196,2019-04-16,000001,Vente,55000,,,SINCHOUX EST,B105,47410,47296,Ségalas,47,,,472960000D0768,,,,,,,,,,,,,0,,,,,BR,futaies résineuses,,,8770,0.525776,44.572367
2019-721196,2019-04-16,000001,Vente,55000,,,SINCHOUX,B104,47410,47296,Ségalas,47,,,472960000D0769,,,,,,,,,,,,,0,,,,,BR,futaies résineuses,,,15240,0.527451,44.575491
2019-721361,2019-05-14,000001,Vente,2700,,,TIRAU,B112,47410,47296,Ségalas,47,,,472960000E0514,,,,,,,,,,,,,0,,,,,T,terres,,,223,0.52228,44.585984
2019-721361,2019-05-14,000001,Vente,2700,,,TIRAU,B112,47410,47296,Ségalas,47,,,472960000E0514,,,,,,,,,,,,,0,,,,,VI,vignes,,,507,0.52228,44.585984
2019-721361,2019-05-14,000001,Vente,2700,,,TIRAU,B112,47410,47296,Ségalas,47,,,472960000E0515,,,,,,,,,,,,,0,,,,,VI,vignes,,,1160,0.52262,44.585738
2019-721361,2019-05-14,000001,Vente,2700,,,TIRAU,B112,47410,47296,Ségalas,47,,,472960000E0516,,,,,,,,,,,,,0,,,,,VI,vignes,,,1325,0.522356,44.585649
2019-721361,2019-05-14,000001,Vente,2700,,,TIRAU,B112,47410,47296,Ségalas,47,,,472960000E0517,,,,,,,,,,,,,0,,,,,T,terres,,,215,0.522388,44.585346
2019-721361,2019-05-14,000001,Vente,2700,,,TIRAU,B112,47410,47296,Ségalas,47,,,472960000E0518,,,,,,,,,,,,,0,,,,,T,terres,,,5770,0.522002,44.584992
2019-721530,2019-06-06,000001,Vente,145000,53,,PETIT MAYNE,B081,47410,47296,Ségalas,47,,,472960000D0009,,,,,,,,,,,,,0,1,Maison,170,5,S,sols,,,750,0.532264,44.587124
2019-721530,2019-06-06,000001,Vente,145000,,,PETIT MAYNE,B081,47410,47296,Ségalas,47,,,472960000D0010,,,,,,,,,,,,,0,,,,,T,terres,,,2765,0.53245,44.586775
2019-722099,2019-09-19,000001,Vente,140000,64,,SINCHOUX,B104,47410,47296,Ségalas,47,,,472960000D0546,,,,,,,,,,,,,0,1,Maison,147,6,S,sols,,,920,0.527147,44.573717
2019-722099,2019-09-19,000001,Vente,140000,,,SINCHOUX EST,B105,47410,47296,Ségalas,47,,,472960000D0730,,,,,,,,,,,,,0,,,,,P,prés,,,9055,0.526881,44.573716
2019-722314,2019-10-30,000001,Vente,238176,,,PRAT GRAND,B095,47410,47296,Ségalas,47,,,472960000E0898,,,,,,,,,,,,,0,,,,,S,sols,,,5050,0.50901,44.580256
2019-722314,2019-10-30,000001,Vente,238176,,,PRAT GRAND,B095,47410,47296,Ségalas,47,,,472960000E0900,,,,,,,,,,,,,0,,,,,S,sols,,,11432,0.509646,44.57996
