id_mutation,date_mutation,numero_disposition,nature_mutation,valeur_fonciere,adresse_numero,adresse_suffixe,adresse_nom_voie,adresse_code_voie,code_postal,code_commune,nom_commune,code_departement,ancien_code_commune,ancien_nom_commune,id_parcelle,ancien_id_parcelle,numero_volume,lot1_numero,lot1_surface_carrez,lot2_numero,lot2_surface_carrez,lot3_numero,lot3_surface_carrez,lot4_numero,lot4_surface_carrez,lot5_numero,lot5_surface_carrez,nombre_lots,code_type_local,type_local,surface_reelle_bati,nombre_pieces_principales,code_nature_culture,nature_culture,code_nature_culture_speciale,nature_culture_speciale,surface_terrain,longitude,latitude
2019-741397,2019-01-02,000001,Vente,2000,,,LANDES DE BOUMELLE,B154,49650,49002,Allonnes,49,,,490020000C0139,,,,,,,,,,,,,0,,,,,BT,taillis simples,CHAT,Châtaigneraie,2193,0.024769,47.338415
2019-741457,2019-01-18,000001,Vente,90000,30,,RUE PIERRE DE RONSARD,0128,49650,49002,Allonnes,49,,,490020000F1216,,,,,,,,,,,,,0,1,Maison,88,4,S,sols,,,110,0.019452,47.298429
2019-741457,2019-01-18,000001,Vente,90000,30,,RUE PIERRE DE RONSARD,0128,49650,49002,Allonnes,49,,,490020000F1216,,,,,,,,,,,,,0,1,Maison,88,4,S,sols,,,110,0.019452,47.298429
2019-741457,2019-01-18,000001,Vente,90000,28,,RUE PIERRE DE RONSARD,0128,49650,49002,Allonnes,49,,,490020000F1220,,,,,,,,,,,,,0,,,,,S,sols,,,137,0.019527,47.298423
2019-741480,2019-01-18,000001,Vente,240000,44,,RUE DU BELLAY,0050,49650,49002,Allonnes,49,,,490020000F1184,,,,,,,,,,,,,0,1,Maison,144,4,S,sols,,,500,0.022374,47.296194
2019-741480,2019-01-18,000001,Vente,240000,44,,RUE DU BELLAY,0050,49650,49002,Allonnes,49,,,490020000F1184,,,,,,,,,,,,,0,1,Maison,144,4,AG,terrains d'agrément,,,750,0.022374,47.296194
2019-741744,2019-02-28,000001,Vente,4000,5456,,LE BOURG,B051,49650,49002,Allonnes,49,,,49002000AB0033,,,,,,,,,,,,,0,4,Local industriel. commercial ou assimilé,37,0,S,sols,,,39,0.022264,47.293572
2019-741820,2019-02-25,000001,Vente,185000,86,,RUE DU CLOS DE VRAI,0517,49650,49002,Allonnes,49,,,490020000F0891,,,,,,,,,,,,,0,1,Maison,104,5,S,sols,,,959,0.025086,47.296887
2019-741823,2019-02-28,000001,Vente,28000,,,RECOUVRANCE,B260,49650,49002,Allonnes,49,,,49002000ZI0048,,,,,,,,,,,,,0,,,,,T,terres,,,1241,-0.005423,47.312346
2019-741833,2019-03-05,000001,Vente,35000,,,LE TERTRE,B282,49650,49002,Allonnes,49,,,490020000F1239,,,,,,,,,,,,,0,,,,,BT,taillis simples,CHAT,Châtaigneraie,3033,,
2019-741898,2019-03-27,000001,Vente,14173.75,,,LES CHAMPS DE L ETANG,B069,49650,49002,Allonnes,49,,,490020000A0081,,,,,,,,,,,,,0,,,,,BT,taillis simples,,,1640,0.033573,47.333721
2019-741898,2019-03-27,000001,Vente,14173.75,,,LANDES DE LA BUSSARDIERE,B157,49650,49002,Allonnes,49,,,490020000C0043,,,,,,,,,,,,,0,,,,,BR,futaies résineuses,,,38659,0.038205,47.342659
2019-741898,2019-03-27,000001,Vente,14173.75,,,LANDES DE BOUMELLE,B154,49650,49002,Allonnes,49,,,490020000C0117,,,,,,,,,,,,,0,,,,,BR,futaies résineuses,,,10386,0.027272,47.343022
2019-741951,2019-03-12,000001,Vente,115000,,,LA PETITE GODINIERE,B215,49650,49002,Allonnes,49,,,49002000ZO0083,,,,,,,,,,,,,0,,,,,T,terres,,,4129,0.02094,47.305919
2019-741951,2019-03-12,000001,Vente,115000,124,,RTE DE LA PETITE GODINIERE,0590,49650,49002,Allonnes,49,,,49002000ZO0333,,,,,,,,,,,,,0,1,Maison,112,5,S,sols,,,465,0.021317,47.306335
2019-741951,2019-03-12,000001,Vente,115000,,,LA PETITE GODINIERE,B215,49650,49002,Allonnes,49,,,49002000ZO0334,,,,,,,,,,,,,0,,,,,T,terres,,,523,0.021187,47.306261
2019-741951,2019-03-12,000001,Vente,115000,,,LA PETITE GODINIERE,B215,49650,49002,Allonnes,49,,,49002000ZO0335,,,,,,,,,,,,,0,,,,,T,terres,,,120,0.021222,47.306142
2019-741997,2019-03-22,000001,Vente,50000,57,,RTE DE L AUTOMNE,0037,49650,49002,Allonnes,49,,,490020000K0604,,,,,,,,,,,,,0,1,Maison,58,3,S,sols,,,534,-0.009872,47.304295
2019-741997,2019-03-22,000001,Vente,50000,57,,RTE DE L AUTOMNE,0037,49650,49002,Allonnes,49,,,490020000K0604,,,,,,,,,,,,,0,1,Maison,58,3,T,terres,,,1300,-0.009872,47.304295
2019-742023,2019-04-11,000001,Vente,53000,,,RUE ALBERT POTTIER,0040,49650,49002,Allonnes,49,,,49002000AB0034,,,,,,,,,,,,,0,3,Dépendance,,0,S,sols,,,428,0.022043,47.293552
2019-742045,2019-03-29,000001,Vente,8500,,,LE BOUCHET,B048,49650,49002,Allonnes,49,,,49002000ZR0181,,,,,,,,,,,,,0,,,,,S,sols,,,304,0.036437,47.287584
2019-742045,2019-03-29,000001,Vente,8500,,,LE BOUCHET,B048,49650,49002,Allonnes,49,,,49002000ZR0183,,,,,,,,,,,,,0,,,,,S,sols,,,3375,0.036846,47.287836
2019-742051,2019-03-29,000001,Vente,200000,122,,RUE ALBERT POTTIER,0040,49650,49002,Allonnes,49,,,49002000AC0318,,,,,,,,,,,,,0,2,Appartement,64,3,S,sols,,,679,0.024845,47.293248
2019-742051,2019-03-29,000001,Vente,200000,122,,RUE ALBERT POTTIER,0040,49650,49002,Allonnes,49,,,49002000AC0318,,,,,,,,,,,,,0,2,Appartement,75,3,S,sols,,,679,0.024845,47.293248
2019-742051,2019-03-29,000001,Vente,200000,122,,RUE ALBERT POTTIER,0040,49650,49002,Allonnes,49,,,49002000AC0318,,,,,,,,,,,,,0,2,Appartement,55,2,S,sols,,,679,0.024845,47.293248
2019-742051,2019-03-29,000001,Vente,200000,122,,RUE ALBERT POTTIER,0040,49650,49002,Allonnes,49,,,49002000AC0318,,,,,,,,,,,,,0,2,Appartement,71,2,S,sols,,,679,0.024845,47.293248
2019-742051,2019-03-29,000001,Vente,200000,122,,RUE ALBERT POTTIER,0040,49650,49002,Allonnes,49,,,49002000AC0318,,,,,,,,,,,,,0,2,Appartement,38,2,S,sols,,,679,0.024845,47.293248
2019-742052,2019-03-30,000001,Vente,128000,63,,RTE DES LOIRES,0675,49650,49002,Allonnes,49,,,490020000E0647,,,,,,,,,,,,,0,1,Maison,68,3,S,sols,,,564,0.034642,47.306988
2019-742052,2019-03-30,000001,Vente,128000,63,,RTE DES LOIRES,0675,49650,49002,Allonnes,49,,,490020000E0651,,,,,,,,,,,,,0,,,,,S,sols,,,119,0.034601,47.306909
2019-742052,2019-03-30,000001,Vente,128000,63,,RTE DES LOIRES,0675,49650,49002,Allonnes,49,,,490020000E0655,,,,,,,,,,,,,0,,,,,S,sols,,,320,0.034772,47.307162
2019-742085,2019-04-03,000001,Vente,70300,64,,RTE DE LA BROSSE,0455,49650,49002,Allonnes,49,,,49002000YC0025,,,,,,,,,,,,,0,1,Maison,74,4,S,sols,,,1021,0.003679,47.295114
2019-742114,2019-04-05,000001,Vente,156000,13,,RUE DE LA MEGRETTERIE,0121,49650,49002,Allonnes,49,,,490020000F0653,,,,,,,,,,,,,0,1,Maison,111,6,S,sols,,,878,0.01494,47.29576
2019-742114,2019-04-05,000001,Vente,156000,13,,RUE DE LA MEGRETTERIE,0121,49650,49002,Allonnes,49,,,490020000F0653,,,,,,,,,,,,,0,2,Appartement,20,1,S,sols,,,878,0.01494,47.29576
2019-742114,2019-04-05,000001,Vente,156000,13,,RUE DE LA MEGRETTERIE,0121,49650,49002,Allonnes,49,,,490020000F0653,,,,,,,,,,,,,0,2,Appartement,20,1,S,sols,,,878,0.01494,47.29576
2019-742114,2019-04-05,000001,Vente,156000,13,,RUE DE LA MEGRETTERIE,0121,49650,49002,Allonnes,49,,,490020000F0653,,,,,,,,,,,,,0,2,Appartement,20,1,S,sols,,,878,0.01494,47.29576
2019-742114,2019-04-05,000001,Vente,156000,,,LA MEGROTERIE,B176,49650,49002,Allonnes,49,,,490020000F0785,,,,,,,,,,,,,0,,,,,T,terres,,,430,0.014401,47.295932
2019-742130,2019-04-13,000002,Vente,75000,48,,RUE ALBERT POTTIER,0040,49650,49002,Allonnes,49,,,49002000AC0076,,,,,,,,,,,,,0,1,Maison,67,2,S,sols,,,655,,
2019-742130,2019-04-13,000002,Vente,75000,,,LE BOURG EST,B052,49650,49002,Allonnes,49,,,49002000AC0077,,,,,,,,,,,,,0,,,,,J,jardins,POTAG,Jardin potager,730,,
2019-742130,2019-04-13,000002,Vente,75000,,,LE BOURG EST,B052,49650,49002,Allonnes,49,,,49002000AC0337,,,,,,,,,,,,,0,,,,,T,terres,,,248,,
2019-742147,2019-04-15,000001,Vente,270000,,,RUE LOUIS TEXIER,0086,49650,49002,Allonnes,49,,,49002000AB0137,,,,,,,,,,,,,0,,,,,J,jardins,POTAG,Jardin potager,1252,0.022505,47.2943
2019-742147,2019-04-15,000001,Vente,270000,172,,RUE ALBERT POTTIER,0040,49650,49002,Allonnes,49,,,49002000AB0147,,,,,,,,,,,,,0,1,Maison,180,5,S,sols,,,582,0.022394,47.293848
2019-742148,2019-04-15,000001,Vente,40000,,,LE BAS CLOS DE VRAI,B018,49650,49002,Allonnes,49,,,49002000ZO0148,,,,,,,,,,,,,0,,,,,T,terres,,,1343,0.028881,47.300578
2019-742170,2019-04-30,000001,Vente,126000,3,,RUE ALFRED DE MUSSET,0041,49650,49002,Allonnes,49,,,490020000F0988,,,,,,,,,,,,,0,1,Maison,73,4,S,sols,,,594,0.020062,47.29843
2019-742174,2019-04-17,000001,Vente,123750,5836,,RUE DE L AUNAY,0035,49650,49002,Allonnes,49,,,49002000ZH0149,,,,,,,,,,,,,0,4,Local industriel. commercial ou assimilé,357,0,S,sols,,,1000,-0.021751,47.308043
2019-742174,2019-04-17,000001,Vente,123750,5836,,RUE DE L AUNAY,0035,49650,49002,Allonnes,49,,,49002000ZH0149,,,,,,,,,,,,,0,4,Local industriel. commercial ou assimilé,357,0,AG,terrains d'agrément,,,453,-0.021751,47.308043
2019-742175,2019-04-17,000001,Vente,980000,5835,F,RUE DE L AUNAY,0035,49650,49002,Allonnes,49,,,49002000ZH0150,,,,,,,,,,,,,0,4,Local industriel. commercial ou assimilé,193,0,S,sols,,,2000,-0.021128,47.307949
2019-742175,2019-04-17,000001,Vente,980000,5835,F,RUE DE L AUNAY,0035,49650,49002,Allonnes,49,,,49002000ZH0150,,,,,,,,,,,,,0,4,Local industriel. commercial ou assimilé,1022,0,S,sols,,,2000,-0.021128,47.307949
2019-742175,2019-04-17,000001,Vente,980000,5835,F,RUE DE L AUNAY,0035,49650,49002,Allonnes,49,,,49002000ZH0150,,,,,,,,,,,,,0,4,Local industriel. commercial ou assimilé,1022,0,AG,terrains d'agrément,,,4251,-0.021128,47.307949
2019-742175,2019-04-17,000001,Vente,980000,5835,F,RUE DE L AUNAY,0035,49650,49002,Allonnes,49,,,49002000ZH0150,,,,,,,,,,,,,0,4,Local industriel. commercial ou assimilé,193,0,AG,terrains d'agrément,,,4251,-0.021128,47.307949
2019-742175,2019-04-17,000001,Vente,980000,,,L AUNAY,B011,49650,49002,Allonnes,49,,,49002000ZH0197,,,,,,,,,,,,,0,,,,,AB,terrains a bâtir,,,478,-0.020831,47.307536
2019-742199,2019-04-18,000001,Vente,4500,,,LA SORINIERE,B276,49650,49002,Allonnes,49,,,49002000YC0127,,,,,,,,,,,,,0,,,,,T,terres,,,16969,,
2019-742337,2019-05-13,000001,Vente,40000,189,B,RTE DE SAUMUR,1195,49650,49002,Allonnes,49,,,49002000YC0178,,,,,,,,,,,,,0,1,Maison,70,5,S,sols,,,631,0.000741,47.297764
2019-742337,2019-05-13,000001,Vente,40000,189,B,RTE DE SAUMUR,1195,49650,49002,Allonnes,49,,,49002000YC0178,,,,,,,,,,,,,0,3,Dépendance,,0,S,sols,,,631,0.000741,47.297764
2019-742376,2019-05-07,000001,Vente,4930,,,LES CHAMPS DE L ETANG,B069,49650,49002,Allonnes,49,,,490020000A0102,,,,,,,,,,,,,0,,,,,BT,taillis simples,,,2380,0.036389,47.334006
2019-742376,2019-05-07,000001,Vente,4930,,,LES HAUTS,B144,49650,49002,Allonnes,49,,,490020000B0363,,,,,,,,,,,,,0,,,,,BT,taillis simples,CHAT,Châtaigneraie,1550,0.039044,47.329414
2019-742376,2019-05-07,000001,Vente,4930,,,LES PARADIS,B201,49650,49002,Allonnes,49,,,490020000B0391,,,,,,,,,,,,,0,,,,,BT,taillis simples,,,920,0.036033,47.326173
2019-742376,2019-05-07,000001,Vente,4930,,,LANDES DE BURTON,B155,49650,49002,Allonnes,49,,,490020000C0014,,,,,,,,,,,,,0,,,,,L,landes,,,1396,0.02816,47.346574
2019-742376,2019-05-07,000001,Vente,4930,,,LES CHAMPS DE L ETANG,B069,49650,49002,Allonnes,49,,,49002000YH0048,,,,,,,,,,,,,0,,,,,T,terres,,,9060,0.035831,47.331301
2019-742381,2019-05-13,000001,Vente,100000,214,,RUE ALBERT POTTIER,0040,49650,49002,Allonnes,49,,,49002000AB0065,,,,,,,,,,,,,0,4,Local industriel. commercial ou assimilé,90,0,S,sols,,,559,0.019858,47.294358
2019-742381,2019-05-13,000001,Vente,100000,214,,RUE ALBERT POTTIER,0040,49650,49002,Allonnes,49,,,49002000AB0562,,,,,,,,,,,,,0,3,Dépendance,,0,S,sols,,,54,0.020022,47.294429
2019-742462,2019-05-20,000001,Vente,90000,,,LE TERTRE,B282,49650,49002,Allonnes,49,,,490020000F1225,,,,,,,,,,,,,0,,,,,S,sols,,,275,0.018475,47.297949
2019-742465,2019-05-24,000001,Vente,99000,,,LE TERTRE,B282,49650,49002,Allonnes,49,,,490020000F1222,,,,,,,,,,,,,0,,,,,S,sols,,,425,0.018312,47.298223
2019-742558,2019-06-13,000001,Vente,4751.31,,,LES HAUTES LANDES OUEST,B143,49650,49002,Allonnes,49,,,49002000ZO0104,,,,,,,,,,,,,0,,,,,T,terres,,,9725,0.028593,47.302579
2019-742582,2019-06-26,000001,Vente,10160,,,LE BOIS SION,B045,49650,49002,Allonnes,49,,,490020000C0202,,,,,,,,,,,,,0,,,,,BR,futaies résineuses,,,9053,0.011694,47.344449
2019-742582,2019-06-26,000001,Vente,10160,,,LES BASSES LANDES NORD,B022,49650,49002,Allonnes,49,,,49002000ZO0120,,,,,,,,,,,,,0,,,,,E,eaux,MARE,Mare,683,0.034815,47.30118
2019-742582,2019-06-26,000001,Vente,10160,,,LES BASSES LANDES NORD,B022,49650,49002,Allonnes,49,,,49002000ZO0120,,,,,,,,,,,,,0,,,,,T,terres,,,26455,0.034815,47.30118
2019-742582,2019-06-26,000001,Vente,10160,,,LES BASSES LANDES NORD,B022,49650,49002,Allonnes,49,,,49002000ZO0298,,,,,,,,,,,,,0,,,,,P,prés,,,1064,0.033591,47.300355
2019-742582,2019-06-26,000001,Vente,10160,,,LES BASSES LANDES NORD,B022,49650,49002,Allonnes,49,,,49002000ZO0300,,,,,,,,,,,,,0,,,,,S,sols,,,129,0.033939,47.300365
2019-742611,2019-06-07,000001,Vente,191000,33,,RUE HUGUES D ALLONNES,0067,49650,49002,Allonnes,49,,,49002000AB0063,,,,,,,,,,,,,0,1,Maison,147,7,S,sols,,,564,0.020232,47.295026
2019-742611,2019-06-07,000001,Vente,191000,33,,RUE HUGUES D ALLONNES,0067,49650,49002,Allonnes,49,,,49002000AB0063,,,,,,,,,,,,,0,1,Maison,147,7,AG,terrains d'agrément,,,636,0.020232,47.295026
2019-742611,2019-06-07,000001,Vente,191000,,,LE BOURG OUEST,B053,49650,49002,Allonnes,49,,,49002000AB0330,,,,,,,,,,,,,0,,,,,AG,terrains d'agrément,,,19,0.020108,47.295025
2019-742611,2019-06-07,000001,Vente,191000,,,LE BOURG OUEST,B053,49650,49002,Allonnes,49,,,49002000AB0330,,,,,,,,,,,,,0,,,,,S,sols,,,42,0.020108,47.295025
2019-742611,2019-06-07,000001,Vente,191000,,,LE BOURG OUEST,B053,49650,49002,Allonnes,49,,,49002000AB0563,,,,,,,,,,,,,0,,,,,S,sols,,,359,0.019972,47.29453
2019-742611,2019-06-07,000001,Vente,191000,,,LE BOURG OUEST,B053,49650,49002,Allonnes,49,,,49002000AB0563,,,,,,,,,,,,,0,,,,,J,jardins,POTAG,Jardin potager,185,0.019972,47.29453
2019-742656,2019-06-28,000001,Vente,115000,,,LA PETITE PERROTTIERE,B219,49650,49002,Allonnes,49,,,49002000ZM0003,,,,,,,,,,,,,0,,,,,T,terres,,,1637,0.00284,47.304897
2019-742656,2019-06-28,000001,Vente,115000,,,LA PETITE PERROTTIERE,B219,49650,49002,Allonnes,49,,,49002000ZM0005,,,,,,,,,,,,,0,,,,,T,terres,,,2763,0.003462,47.304341
2019-742656,2019-06-28,000001,Vente,115000,30,,RTE DE LA PETITE PERROTIERE,1000,49650,49002,Allonnes,49,,,49002000ZM0149,,,,,,,,,,,,,0,1,Maison,60,2,S,sols,,,1400,0.002731,47.30461
2019-742660,2019-06-27,000001,Vente,1537.8,,,LE VIGNEAU,B294,49650,49002,Allonnes,49,,,49002000ZS0083,,,,,,,,,,,,,0,,,,,T,terres,,,3495,0.01722,47.275824
2019-742660,2019-06-27,000001,Vente,1537.8,,,LE VIGNEAU,B294,49650,49002,Allonnes,49,,,49002000ZS0083,,,,,,,,,,,,,0,,,,,T,terres,,,3495,0.01722,47.275824
2019-742727,2019-07-12,000001,Vente,104000,38,,RUE PIERRE DE RONSARD,0128,49650,49002,Allonnes,49,,,490020000F1231,,,,,,,,,,,,,0,,,,,S,sols,,,248,0.018956,47.298488
2019-742731,2019-07-05,000001,Vente,1,,,RUE PIERRE DE RONSARD,0128,49650,49002,Allonnes,49,,,490020000F1233,,,,,,,,,,,,,0,,,,,S,sols,,,3,0.019153,47.298359
2019-742731,2019-07-05,000001,Vente,1,,,RUE PIERRE DE RONSARD,0128,49650,49002,Allonnes,49,,,490020000F1234,,,,,,,,,,,,,0,,,,,S,sols,,,5,0.019029,47.298371
2019-742731,2019-07-05,000001,Vente,1,,,RUE PIERRE DE RONSARD,0128,49650,49002,Allonnes,49,,,490020000F1235,,,,,,,,,,,,,0,,,,,S,sols,,,6,0.018886,47.298384
2019-742731,2019-07-05,000001,Vente,1,,,RUE PIERRE DE RONSARD,0128,49650,49002,Allonnes,49,,,490020000F1236,,,,,,,,,,,,,0,,,,,S,sols,,,2,0.018803,47.298393
2019-742731,2019-07-05,000001,Vente,1,,,RUE PIERRE DE RONSARD,0128,49650,49002,Allonnes,49,,,490020000F1238,,,,,,,,,,,,,0,,,,,S,sols,,,22,0.018538,47.298367
2019-742739,2019-07-10,000001,Vente,114000,36,,RUE JULIEN BUDAN,0073,49650,49002,Allonnes,49,,,49002000AB0398,,,,,,,,,,,,,0,1,Maison,81,3,S,sols,,,515,0.02388,47.291418
2019-742754,2019-07-16,000001,Vente,145000,8,,RUE DU DOILARDE,0054,49650,49002,Allonnes,49,,,490020000F1126,,,,,,,,,,,,,0,1,Maison,137,7,S,sols,,,625,0.029158,47.296252
2019-742795,2019-07-23,000001,Vente,11210,,,LES HAUTS CHAMPS MAILLARDS,B147,49650,49002,Allonnes,49,,,49002000YI0010,,,,,,,,,,,,,0,,,,,BR,futaies résineuses,,,3458,0.033359,47.337659
2019-742796,2019-07-23,000002,Vente,2000,,,LANDES DE BURTON,B155,49650,49002,Allonnes,49,,,490020000C0020,,,,,,,,,,,,,0,,,,,L,landes,,,6904,0.029669,47.344934
2019-743010,2019-08-02,000002,Vente,54000,11,,RUE LOUIS TEXIER,0086,49650,49002,Allonnes,49,,,49002000AB0126,,,,,,,,,,,,,0,1,Maison,52,3,S,sols,,,325,0.023956,47.294396
2019-743059,2019-08-05,000001,Vente,40000,76,,RUE ALBERT POTTIER,0040,49650,49002,Allonnes,49,,,49002000AC0320,,,,,,,,,,,,,0,4,Local industriel. commercial ou assimilé,105,0,S,sols,,,302,0.027467,47.292736
2019-743076,2019-08-08,000001,Vente,160000,29,,RUE HUGUES D ALLONNES,0067,49650,49002,Allonnes,49,,,49002000AB0067,,,,,,,,,,,,,0,1,Maison,111,4,S,sols,,,932,0.020379,47.294799
2019-743076,2019-08-08,000001,Vente,160000,,,RUE ALBERT POTTIER,0040,49650,49002,Allonnes,49,,,49002000AB0545,,,,,,,,,,,,,0,,,,,S,sols,,,15,0.020551,47.295021
2019-743076,2019-08-08,000001,Vente,160000,,,RUE ALBERT POTTIER,0040,49650,49002,Allonnes,49,,,49002000AB0546,,,,,,,,,,,,,0,,,,,S,sols,,,32,0.020497,47.294926
2019-743076,2019-08-08,000001,Vente,160000,,,RUE ALBERT POTTIER,0040,49650,49002,Allonnes,49,,,49002000AB0561,,,,,,,,,,,,,0,,,,,S,sols,,,128,0.020159,47.294409
2019-743081,2019-08-12,000001,Vente,40000,,,LE CHAPY,B072,49650,49002,Allonnes,49,,,49002000ZT0035,,,,,,,,,,,,,0,,,,,T,terres,,,12063,0.035565,47.271594
2019-743081,2019-08-12,000001,Vente,40000,89,,RTE DU CHAPY,0490,49650,49002,Allonnes,49,,,49002000ZT0107,,,,,,,,,,,,,0,1,Maison,40,1,S,sols,,,1004,0.035789,47.272126
2019-743170,2019-08-27,000001,Vente,165000,40,,RUE DE LA MEGRETTERIE,0121,49650,49002,Allonnes,49,,,490020000F0656,,,,,,,,,,,,,0,1,Maison,131,5,S,sols,,,924,0.015964,47.296581
2019-743199,2019-08-29,000001,Vente,2574,,,LE VIGNEAU,B294,49650,49002,Allonnes,49,,,49002000ZS0082,,,,,,,,,,,,,0,,,,,T,terres,,,2911,0.018002,47.276035
2019-743199,2019-08-29,000001,Vente,2574,,,LE VIGNEAU,B294,49650,49002,Allonnes,49,,,49002000ZS0082,,,,,,,,,,,,,0,,,,,T,terres,,,2912,0.018002,47.276035
2019-743199,2019-08-29,000001,Vente,2574,,,RUSSE,B272,49650,49002,Allonnes,49,,,49002000ZS0171,,,,,,,,,,,,,0,,,,,T,terres,,,5877,0.017288,47.274806
2019-743202,2019-09-05,000001,Vente,20000,,,LES HAUTS,B144,49650,49002,Allonnes,49,,,490020000B0353,,,,,,,,,,,,,0,,,,,BT,taillis simples,,,700,0.039526,47.329974
2019-743202,2019-09-05,000001,Vente,20000,,,LANDES DE BURTON,B155,49650,49002,Allonnes,49,,,490020000C0021,,,,,,,,,,,,,0,,,,,BR,futaies résineuses,,,23899,0.030776,47.345134
2019-743202,2019-09-05,000001,Vente,20000,,,LES HAUTS CHAMPS MAILLARDS,B147,49650,49002,Allonnes,49,,,490020000C0099,,,,,,,,,,,,,0,,,,,BT,taillis simples,,,8250,0.034091,47.338523
2019-743202,2019-09-05,000001,Vente,20000,,,LES HAUTS CHAMPS MAILLARDS,B147,49650,49002,Allonnes,49,,,490020000C0105,,,,,,,,,,,,,0,,,,,BT,taillis simples,,,9501,0.031521,47.340162
2019-743202,2019-09-05,000001,Vente,20000,,,LANDES DE BOUMELLE,B154,49650,49002,Allonnes,49,,,490020000C0124,,,,,,,,,,,,,0,,,,,BR,futaies résineuses,,,7330,0.025282,47.342308
2019-743202,2019-09-05,000001,Vente,20000,,,LANDES DE BOUMELLE,B154,49650,49002,Allonnes,49,,,490020000C0158,,,,,,,,,,,,,0,,,,,BT,taillis simples,,,3660,0.020549,47.343156
2019-743209,2019-09-12,000001,Vente,120000,,,LES PETITS CHAMPS MAILLARD,B017,49650,49002,Allonnes,49,,,490020000C0055,,,,,,,,,,,,,0,,,,,S,sols,,,1828,0.037743,47.338964
2019-743209,2019-09-12,000001,Vente,120000,788,,RTE DE L AUTOMNE,0037,49650,49002,Allonnes,49,,,490020000C0056,,,,,,,,,,,,,0,1,Maison,153,6,S,sols,,,1787,0.037529,47.33879
2019-743237,2019-09-02,000001,Vente,140000,65,,RTE DES LOIRES,0675,49650,49002,Allonnes,49,,,490020000E0646,,,,,,,,,,,,,0,1,Maison,97,4,S,sols,,,634,0.03426,47.307099
2019-743237,2019-09-02,000001,Vente,140000,65,,RTE DES LOIRES,0675,49650,49002,Allonnes,49,,,490020000E0650,,,,,,,,,,,,,0,,,,,S,sols,,,136,0.034209,47.307004
2019-743237,2019-09-02,000001,Vente,140000,65,,RTE DES LOIRES,0675,49650,49002,Allonnes,49,,,490020000E0654,,,,,,,,,,,,,0,,,,,S,sols,,,233,0.034413,47.307229
2019-743261,2019-09-05,000001,Vente,2000,,,LES SOUCHETS,B277,49650,49002,Allonnes,49,,,49002000YB0042,,,,,,,,,,,,,0,,,,,BP,peupleraies,,,7409,-0.028506,47.297112
2019-743405,2019-09-19,000001,Vente,30000,,,LES HAUTES LANDES EST,B142,49650,49002,Allonnes,49,,,49002000ZO0282,,,,,,,,,,,,,0,,,,,T,terres,,,1004,0.035993,47.306737
2019-743408,2019-09-18,000001,Vente,148000,7,,RUE DU DOILARDE,0054,49650,49002,Allonnes,49,,,490020000F1120,,,,,,,,,,,,,0,1,Maison,80,4,AB,terrains a bâtir,,,1129,0.029767,47.295813
2019-743416,2019-10-02,000001,Vente,3000,,,LA COQUERE,B088,49650,49002,Allonnes,49,,,49002000YA0048,,,,,,,,,,,,,0,,,,,T,terres,,,7600,-0.031896,47.292103
2019-743416,2019-10-02,000001,Vente,3000,,,LA COQUERE,B088,49650,49002,Allonnes,49,,,49002000YA0048,,,,,,,,,,,,,0,,,,,T,terres,,,2900,-0.031896,47.292103
2019-743416,2019-10-02,000001,Vente,3000,,,LA COQUERE,B088,49650,49002,Allonnes,49,,,49002000YA0048,,,,,,,,,,,,,0,,,,,T,terres,,,743,-0.031896,47.292103
2019-743426,2019-09-23,000001,Vente,90000,52,,RUE FRANCOIS CORNILLEAU,0062,49650,49002,Allonnes,49,,,490020000F1227,,,,,,,,,,,,,0,,,,,S,sols,,,302,0.018235,47.297934
2019-743427,2019-09-20,000001,Vente,90000,32,,RUE PIERRE DE RONSARD,0128,49650,49002,Allonnes,49,,,490020000F1217,,,,,,,,,,,,,0,,,,,S,sols,,,253,0.019321,47.298441
2019-743464,2019-09-30,000001,Vente,125000,21,,RUE DES GLYCINES,0063,49650,49002,Allonnes,49,,,49002000AB0296,,,,,,,,,,,,,0,1,Maison,59,3,S,sols,,,437,0.021397,47.291239
2019-743496,2019-10-17,000001,Vente,45000,21,,CHE DES CALOTTIERES,0475,49650,49002,Allonnes,49,,,49002000ZO0328,,,,,,,,,,,,,0,1,Maison,80,2,T,terres,,,1341,0.035304,47.30265
2019-743496,2019-10-17,000001,Vente,45000,21,,CHE DES CALOTTIERES,0475,49650,49002,Allonnes,49,,,49002000ZO0328,,,,,,,,,,,,,0,1,Maison,80,2,S,sols,,,500,0.035304,47.30265
2019-743501,2019-09-27,000001,Vente,270000,5810,F,LES HAUTS DE RECOUVRANCES,B312,49650,49002,Allonnes,49,,,490020000K0726,,,,,,,,,,,,,0,1,Maison,153,5,S,sols,,,500,-0.008353,47.317632
2019-743501,2019-09-27,000001,Vente,270000,5810,F,LES HAUTS DE RECOUVRANCES,B312,49650,49002,Allonnes,49,,,490020000K0726,,,,,,,,,,,,,0,1,Maison,153,5,T,terres,,,1870,-0.008353,47.317632
2019-743503,2019-09-26,000001,Vente,140000,42,,RUE DU BOIS CLAIRAY,0046,49650,49002,Allonnes,49,,,490020000F1070,,,,,,,,,,,,,0,1,Maison,97,5,S,sols,,,713,0.028757,47.294913
2019-743611,2019-10-29,000001,Vente,2866.2,,,LANDES DE BURTON,B155,49650,49002,Allonnes,49,,,490020000C0028,,,,,,,,,,,,,0,,,,,BR,futaies résineuses,,,21928,0.031626,47.344185
2019-743611,2019-10-29,000001,Vente,2866.2,,,LANDES DE BURTON,B155,49650,49002,Allonnes,49,,,490020000C0029,,,,,,,,,,,,,0,,,,,BR,futaies résineuses,,,6734,0.032983,47.345497
2019-743627,2019-10-16,000001,Vente,225000,74,,RUE FRANCOIS RABELAIS,0061,49650,49002,Allonnes,49,,,490020000F1006,,,,,,,,,,,,,0,1,Maison,110,4,S,sols,,,1316,0.015762,47.298527
2019-743627,2019-10-16,000001,Vente,225000,,,LE TERTRE,B282,49650,49002,Allonnes,49,,,49002000ZN0098,,,,,,,,,,,,,0,,,,,T,terres,,,51,0.015582,47.298606
2019-743627,2019-10-16,000001,Vente,225000,,,LE TERTRE,B282,49650,49002,Allonnes,49,,,49002000ZN0102,,,,,,,,,,,,,0,,,,,S,sols,,,78,0.015682,47.298648
2019-743627,2019-10-16,000001,Vente,225000,,,LE TERTRE,B282,49650,49002,Allonnes,49,,,49002000ZN0105,,,,,,,,,,,,,0,,,,,S,sols,,,39,0.015658,47.298674
2019-743657,2019-10-28,000001,Vente,400,,,LE GRAND NOYER SAVARY,B118,49650,49002,Allonnes,49,,,49002000ZM0056,,,,,,,,,,,,,0,,,,,T,terres,,,2755,0.012552,47.30668
2019-743661,2019-11-18,000001,Vente,84000,,,LA PIECE DU GRAND BOIS,B231,49650,49002,Allonnes,49,,,490020000I0934,,,,,,,,,,,,,0,,,,,T,terres,,,9003,0.001087,47.298902
2019-743661,2019-11-18,000001,Vente,84000,,,LA PIECE DU GRAND BOIS,B231,49650,49002,Allonnes,49,,,49002000ZK0071,,,,,,,,,,,,,0,,,,,T,terres,,,274,0.00058,47.299766
2019-743661,2019-11-18,000001,Vente,84000,,,LA PIECE DU GRAND BOIS,B231,49650,49002,Allonnes,49,,,49002000ZK0072,,,,,,,,,,,,,0,,,,,T,terres,,,1179,0.000957,47.300501
2019-743661,2019-11-18,000001,Vente,84000,,,LA PIECE DU GRAND BOIS,B231,49650,49002,Allonnes,49,,,49002000ZK0074,,,,,,,,,,,,,0,,,,,T,terres,,,105,0.000602,47.299687