id_mutation,date_mutation,numero_disposition,nature_mutation,valeur_fonciere,adresse_numero,adresse_suffixe,adresse_nom_voie,adresse_code_voie,code_postal,code_commune,nom_commune,code_departement,ancien_code_commune,ancien_nom_commune,id_parcelle,ancien_id_parcelle,numero_volume,lot1_numero,lot1_surface_carrez,lot2_numero,lot2_surface_carrez,lot3_numero,lot3_surface_carrez,lot4_numero,lot4_surface_carrez,lot5_numero,lot5_surface_carrez,nombre_lots,code_type_local,type_local,surface_reelle_bati,nombre_pieces_principales,code_nature_culture,nature_culture,code_nature_culture_speciale,nature_culture_speciale,surface_terrain,longitude,latitude
2019-741445,2019-01-21,000001,Vente,430000,31,,RUE DE CHAMPIGNY (CHACE),0125,49400,49060,Bellevigne-les-Châteaux,49,,,49060000AD0107,,,,,,,,,,,,,0,4,Local industriel. commercial ou assimilé,,,S,sols,,,9988,,
2019-741446,2019-01-09,000001,Vente,80000,,,GRAND FOND,B137,49260,49060,Bellevigne-les-Châteaux,49,,,49060046AE0541,,,,,,,,,,,,,0,,,,,T,terres,,,5000,-0.037402,47.167597
2019-741447,2019-01-08,000001,Vente,260000,8,,RUE EMILE LANDAIS (CHACE),0200,49400,49060,Bellevigne-les-Châteaux,49,,,49060000AB0123,,,,,,,,,,,,,0,,,,,J,jardins,POTAG,Jardin potager,1960,-0.067874,47.21671
2019-741447,2019-01-08,000001,Vente,260000,6,,RUE EMILE LANDAIS (CHACE),0200,49400,49060,Bellevigne-les-Châteaux,49,,,49060000AB0124,,,,,,,,,,,,,0,1,Maison,160,5,S,sols,,,1037,-0.068123,47.216729
2019-741447,2019-01-08,000001,Vente,260000,6,,RUE EMILE LANDAIS (CHACE),0200,49400,49060,Bellevigne-les-Châteaux,49,,,49060000AB0124,,,,,,,,,,,,,0,1,Maison,56,2,S,sols,,,1037,-0.068123,47.216729
2019-741447,2019-01-08,000001,Vente,260000,6,,RUE EMILE LANDAIS (CHACE),0200,49400,49060,Bellevigne-les-Châteaux,49,,,49060000AB0124,,,,,,,,,,,,,0,1,Maison,47,2,S,sols,,,1037,-0.068123,47.216729
2019-741508,2019-01-23,000001,Vente,35700,,,LES VERNES,B061,49400,49060,Bellevigne-les-Châteaux,49,,,490600000A0395,,,,,,,,,,,,,0,,,,,VI,vignes,,,2110,-0.077652,47.21977
2019-741508,2019-01-23,000001,Vente,35700,,,LES VERNES,B061,49400,49060,Bellevigne-les-Châteaux,49,,,490600000A0396,,,,,,,,,,,,,0,,,,,VI,vignes,,,1155,-0.077496,47.219562
2019-741582,2019-01-30,000001,Vente,61500,38,,RUE DE L AMIRAL MAILLE BREZE,4212,49260,49060,Bellevigne-les-Châteaux,49,,,49060046AB0024,,,,,,,,,,,,,0,1,Maison,62,4,S,sols,,,186,-0.060448,47.175994
2019-741605,2019-01-28,000001,Vente,1801,,,LA CHAPE AUX MOINES,B014,49400,49060,Bellevigne-les-Châteaux,49,,,49060000AA0167,,,,,,,,,,,,,0,,,,,T,terres,,,536,-0.076537,47.213227
2019-741635,2019-01-31,000001,Vente,900,,,CLOS PRIEUR,B019,49400,49060,Bellevigne-les-Châteaux,49,,,490600000A0064,,,,,,,,,,,,,0,,,,,T,terres,,,450,-0.075336,47.227015
2019-741654,2019-02-06,000001,Vente,25000,5063,,RUE FOUCAULT (ST CYR),4272,49260,49060,Bellevigne-les-Châteaux,49,,,49060274AB0172,,,,,,,,,,,,,0,1,Maison,40,2,S,sols,,,143,-0.056925,47.19427
2019-741660,2019-02-20,000001,Vente,156000,22,,RUE LOUIS ROBINEAU,0252,49400,49060,Bellevigne-les-Châteaux,49,,,49060000AD0188,,,,,,,,,,,,,0,1,Maison,90,4,S,sols,,,534,-0.061006,47.215656
2019-741676,2019-01-17,000001,Vente,121967,,,RUE DE LA POSTE (CHACE),0350,49400,49060,Bellevigne-les-Châteaux,49,,,49060000AB0013,,,,,,,,,,,,,0,,,,,VI,vignes,,,696,-0.07359,47.216433
2019-741676,2019-01-17,000001,Vente,121967,,,RUE D'ESPINATS,0220,49400,49060,Bellevigne-les-Châteaux,49,,,49060000AB0296,,,,,,,,,,,,,0,,,,,VI,vignes,,,4246,-0.073689,47.216058
2019-741677,2019-01-17,000002,Vente,138033,,,RUE DE LA POSTE (CHACE),0350,49400,49060,Bellevigne-les-Châteaux,49,,,49060000AB0014,,,,,,,,,,,,,0,,,,,VI,vignes,,,760,-0.073253,47.216358
2019-741677,2019-01-17,000002,Vente,138033,3,,RUE D'ESPINATS,0220,49400,49060,Bellevigne-les-Châteaux,49,,,49060000AB0224,,,,,,,,,,,,,0,,,,,VI,vignes,,,334,-0.074124,47.215206
2019-741677,2019-01-17,000002,Vente,138033,,,RUE D'ESPINATS,0220,49400,49060,Bellevigne-les-Châteaux,49,,,49060000AB0225,,,,,,,,,,,,,0,,,,,VI,vignes,,,4499,-0.073621,47.215162
2019-741688,2019-02-12,000001,Vente,120000,11,,RUE DE L ETOILE,4220,49260,49060,Bellevigne-les-Châteaux,49,,,49060046ZD0121,,,,,,,,,,,,,0,1,Maison,124,3,S,sols,,,1960,-0.039544,47.165378
2019-741688,2019-02-12,000001,Vente,120000,,,LES ALBAUDESES,B072,49260,49060,Bellevigne-les-Châteaux,49,,,49060046ZD0329,,,,,,,,,,,,,0,,,,,T,terres,,,911,-0.039979,47.165496
2019-741688,2019-02-12,000001,Vente,120000,,,LES ALBAUDESES,B072,49260,49060,Bellevigne-les-Châteaux,49,,,49060046ZD0330,,,,,,,,,,,,,0,,,,,S,sols,,,1251,-0.03974,47.165158
2019-741713,2019-02-22,000001,Vente,14000,,,LES POYEUX,B046,49400,49060,Bellevigne-les-Châteaux,49,,,490600000C1024,,,,,,,,,,,,,0,,,,,VI,vignes,,,2720,-0.0508,47.212372
2019-741746,2019-02-26,000001,Vente,6605,,,LES FROGERES,B027,49400,49060,Bellevigne-les-Châteaux,49,,,490600000C0268,,,,,,,,,,,,,0,,,,,VI,vignes,,,650,-0.052568,47.216681
2019-741762,2019-03-11,000001,Vente,700,,,LE CHAMP DU TOIT,B012,49400,49060,Bellevigne-les-Châteaux,49,,,490600000A0780,,,,,,,,,,,,,0,,,,,T,terres,,,510,-0.07834,47.217421
2019-741765,2019-02-18,000001,Vente,119500,1,,IMP DES GLYCINES,4226,49260,49060,Bellevigne-les-Châteaux,49,,,49060046ZA0631,,,,,,,,,,,,,0,1,Maison,90,3,S,sols,,,476,-0.066637,47.171688
2019-741779,2019-02-15,000001,Vente,133000,9,,RUE DES TILLEULS (BREZE),4250,49260,49060,Bellevigne-les-Châteaux,49,,,49060046ZA0606,,,,,,,,,,,,,0,1,Maison,80,4,S,sols,,,658,-0.065759,47.172606
2019-741794,2019-03-06,000001,Vente,33000,3,,RUET DES DARDS,4281,49260,49060,Bellevigne-les-Châteaux,49,,,49060274AB0129,,,,,,,,,,,,,0,1,Maison,37,1,S,sols,,,423,-0.058476,47.194165
2019-741836,2019-03-13,000001,Vente,2781,,,LES ESSARTS,B127,49260,49060,Bellevigne-les-Châteaux,49,,,49060046ZA0357,,,,,,,,,,,,,0,,,,,T,terres,,,789,-0.063579,47.180245
2019-741836,2019-03-13,000001,Vente,2781,,,LES ESSARTS,B127,49260,49060,Bellevigne-les-Châteaux,49,,,49060046ZA0359,,,,,,,,,,,,,0,,,,,T,terres,,,337,-0.063436,47.179563
2019-741836,2019-03-13,000001,Vente,2781,,,LES ESSARTS,B127,49260,49060,Bellevigne-les-Châteaux,49,,,49060046ZA0367,,,,,,,,,,,,,0,,,,,T,terres,,,1655,-0.06444,47.180207
2019-741842,2019-03-12,000001,Vente,56000,3,,RUE EMILE LANDAIS (CHACE),0200,49400,49060,Bellevigne-les-Châteaux,49,,,49060000AB0242,,,27,,,,,,,,,,1,3,Dépendance,,0,,,,,,-0.069003,47.217716
2019-741842,2019-03-12,000001,Vente,56000,3,,RUE EMILE LANDAIS (CHACE),0200,49400,49060,Bellevigne-les-Châteaux,49,,,49060000AB0242,,,14,,,,,,,,,,1,2,Appartement,44,2,,,,,,-0.069003,47.217716
2019-741878,2019-03-25,000001,Vente,5700,,,CHE DES PEUPLERAIES,0320,49400,49060,Bellevigne-les-Châteaux,49,,,49060000AC0232,,,,,,,,,,,,,0,,,,,T,terres,,,1733,-0.07315,47.212582
2019-741974,2019-03-19,000001,Vente,75000,2,,RUE BELLES CAVES,4213,49260,49060,Bellevigne-les-Châteaux,49,,,49060046ZB0730,,,,,,,,,,,,,0,1,Maison,51,3,S,sols,,,653,-0.0557,47.18312
2019-741974,2019-03-19,000001,Vente,75000,,,LA GRUCHE (BREZE),B148,49260,49060,Bellevigne-les-Châteaux,49,,,49060046ZB0917,,,,,,,,,,,,,0,,,,,S,sols,,,84,-0.05555,47.183237
2019-742014,2019-03-22,000001,Vente,60000,9000,F,RTE DE CHACE,4280,49260,49060,Bellevigne-les-Châteaux,49,,,49060274ZB0360,,,,,,,,,,,,,0,4,Local industriel. commercial ou assimilé,,0,T,terres,,,1475,-0.060177,47.199467
2019-742055,2019-03-29,000002,Vente,1150000,,,RUE DES PAILLONS,0300,49400,49060,Bellevigne-les-Châteaux,49,,,49060000AD0099,,,,,,,,,,,,,0,,,,,S,sols,,,410,-0.065647,47.216915
2019-742055,2019-03-29,000002,Vente,1150000,,,RUE DES PAILLONS,0300,49400,49060,Bellevigne-les-Châteaux,49,,,49060000AD0101,,,,,,,,,,,,,0,,,,,S,sols,,,30,-0.065858,47.216817
2019-742055,2019-03-29,000002,Vente,1150000,,,RUE DES PAILLONS,0300,49400,49060,Bellevigne-les-Châteaux,49,,,49060000AD0102,,,,,,,,,,,,,0,,,,,S,sols,,,17,-0.065901,47.216692
2019-742055,2019-03-29,000002,Vente,1150000,,,RUE DES PAILLONS,0300,49400,49060,Bellevigne-les-Châteaux,49,,,49060000AD0104,,,,,,,,,,,,,0,,,,,T,terres,,,29,-0.06594,47.216601
2019-742055,2019-03-29,000002,Vente,1150000,,,RUE DES PAILLONS,0300,49400,49060,Bellevigne-les-Châteaux,49,,,49060000AD0119,,,,,,,,,,,,,0,,,,,S,sols,,,1108,-0.065613,47.216777
2019-742055,2019-03-29,000002,Vente,1150000,1,,RUE DES PAILLONS,0300,49400,49060,Bellevigne-les-Châteaux,49,,,49060000AD0198,,,,,,,,,,,,,0,4,Local industriel. commercial ou assimilé,900,0,S,sols,,,2498,-0.066093,47.216875
2019-742055,2019-03-29,000002,Vente,1150000,12,,ALL DES TILLEULS (CHACE),0440,49400,49060,Bellevigne-les-Châteaux,49,,,49060000AD0200,,,,,,,,,,,,,0,4,Local industriel. commercial ou assimilé,82,0,S,sols,,,576,-0.066794,47.216787
2019-742055,2019-03-29,000002,Vente,1150000,12,,ALL DES TILLEULS (CHACE),0440,49400,49060,Bellevigne-les-Châteaux,49,,,49060000AD0200,,,,,,,,,,,,,0,2,Appartement,85,3,S,sols,,,576,-0.066794,47.216787
2019-742055,2019-03-29,000002,Vente,1150000,12,,ALL DES TILLEULS (CHACE),0440,49400,49060,Bellevigne-les-Châteaux,49,,,49060000AD0201,,,3,,,,,,,,,,1,2,Appartement,29,2,,,,,,-0.066696,47.21693
2019-742055,2019-03-29,000002,Vente,1150000,12,,ALL DES TILLEULS (CHACE),0440,49400,49060,Bellevigne-les-Châteaux,49,,,49060000AD0201,,,1,,,,,,,,,,1,3,Dépendance,,0,,,,,,-0.066696,47.21693
2019-742077,2019-03-27,000001,Vente,3500,,,LE TOUCHEAU,B264,49260,49060,Bellevigne-les-Châteaux,49,,,49060274AD0066,,,,,,,,,,,,,0,,,,,VI,vignes,,,640,-0.037015,47.192939
2019-742112,2019-04-01,000001,Vente,425000,5419,F,RUE DU DOCTEUR WEISS,0485,49400,49060,Bellevigne-les-Châteaux,49,,,49060000AE0083,,,,,,,,,,,,,0,4,Local industriel. commercial ou assimilé,1287,0,S,sols,,,4047,-0.057501,47.20834
2019-742163,2019-04-29,000001,Vente,86000,9,,RUE DU VIEUX CHATEAU,4252,49260,49060,Bellevigne-les-Châteaux,49,,,49060046AE0304,,,,,,,,,,,,,0,1,Maison,78,3,S,sols,,,286,-0.034778,47.16704
2019-742182,2019-05-02,000001,Vente,145000,23,,RUE DE L AMIRAL MAILLE BREZE,4212,49260,49060,Bellevigne-les-Châteaux,49,,,49060046AB0245,,,,,,,,,,,,,0,1,Maison,150,6,S,sols,,,842,-0.059436,47.173513
2019-742190,2019-04-19,000001,Vente,94000,10,,RUE DE LA POSTE (CHACE),0350,49400,49060,Bellevigne-les-Châteaux,49,,,49060000AB0194,,,,,,,,,,,,,0,1,Maison,100,4,S,sols,,,397,-0.071325,47.216345
2019-742222,2019-05-06,000001,Vente,136000,,,RUE DES FONTAINES,0230,49400,49060,Bellevigne-les-Châteaux,49,,,49060000AA0054,,,,,,,,,,,,,0,,,,,T,terres,,,82,-0.079183,47.215862
2019-742222,2019-05-06,000001,Vente,136000,15,,RUE DU THOUET,0430,49400,49060,Bellevigne-les-Châteaux,49,,,49060000AA0055,,,,,,,,,,,,,0,1,Maison,145,5,S,sols,,,676,-0.07937,47.215849
2019-742223,2019-05-09,000001,Vente,13969.06,,,BOURGUENNE,B093,49260,49060,Bellevigne-les-Châteaux,49,,,49060046ZC0087,,,,,,,,,,,,,0,,,,,VI,vignes,,,4989,-0.049186,47.174075
2019-742223,2019-05-09,000001,Vente,13969.06,,,BOURGUENNE,B093,49260,49060,Bellevigne-les-Châteaux,49,,,49060046ZC0113,,,,,,,,,,,,,0,,,,,VI,vignes,,,599,-0.050543,47.176143
2019-742223,2019-05-09,000001,Vente,13969.06,,,BOURGUENNE,B093,49260,49060,Bellevigne-les-Châteaux,49,,,49060046ZC0114,,,,,,,,,,,,,0,,,,,VI,vignes,,,688,-0.051016,47.176038
2019-742223,2019-05-09,000001,Vente,13969.06,,,BOURGUENNE,B093,49260,49060,Bellevigne-les-Châteaux,49,,,49060046ZC0115,,,,,,,,,,,,,0,,,,,VI,vignes,,,628,-0.051046,47.176076
2019-742223,2019-05-09,000001,Vente,13969.06,,,BOURGUENNE,B093,49260,49060,Bellevigne-les-Châteaux,49,,,49060046ZC0116,,,,,,,,,,,,,0,,,,,VI,vignes,,,673,-0.050975,47.176155
2019-742223,2019-05-09,000001,Vente,13969.06,,,BOURGUENNE,B093,49260,49060,Bellevigne-les-Châteaux,49,,,49060046ZC0117,,,,,,,,,,,,,0,,,,,VI,vignes,,,675,-0.05069,47.176307
2019-742239,2019-04-25,000001,Vente,110000,21,,RUE DES TILLEULS (BREZE),4250,49260,49060,Bellevigne-les-Châteaux,49,,,49060046ZA0638,,,,,,,,,,,,,0,1,Maison,100,3,S,sols,,,635,-0.066928,47.172182
2019-742297,2019-05-27,000001,Vente,100,,,LES PLANTES,B252,49260,49060,Bellevigne-les-Châteaux,49,,,49060274ZB0025,,,,,,,,,,,,,0,,,,,VI,vignes,,,3025,-0.058203,47.199302
2019-742297,2019-05-27,000001,Vente,100,,,LES PLANTES,B252,49260,49060,Bellevigne-les-Châteaux,49,,,49060274ZB0025,,,,,,,,,,,,,0,,,,,T,terres,,,2135,-0.058203,47.199302
2019-742297,2019-05-27,000001,Vente,100,,,LES PLANTES,B252,49260,49060,Bellevigne-les-Châteaux,49,,,49060274ZB0026,,,,,,,,,,,,,0,,,,,VI,vignes,,,3040,-0.057978,47.200081
2019-742297,2019-05-27,000001,Vente,100,,,LES PLANTES,B252,49260,49060,Bellevigne-les-Châteaux,49,,,49060274ZB0026,,,,,,,,,,,,,0,,,,,T,terres,,,2580,-0.057978,47.200081
2019-742297,2019-05-27,000001,Vente,100,,,LES PLANTES,B252,49260,49060,Bellevigne-les-Châteaux,49,,,49060274ZB0319,,,,,,,,,,,,,0,,,,,VI,vignes,,,734,-0.057547,47.200306
2019-742298,2019-05-27,000002,Vente,61900,,,LES PLANTES,B252,49260,49060,Bellevigne-les-Châteaux,49,,,49060274ZB0025,,,,,,,,,,,,,0,,,,,T,terres,,,2135,-0.058203,47.199302
2019-742298,2019-05-27,000002,Vente,61900,,,LES PLANTES,B252,49260,49060,Bellevigne-les-Châteaux,49,,,49060274ZB0025,,,,,,,,,,,,,0,,,,,VI,vignes,,,3025,-0.058203,47.199302
2019-742298,2019-05-27,000002,Vente,61900,,,LES PLANTES,B252,49260,49060,Bellevigne-les-Châteaux,49,,,49060274ZB0026,,,,,,,,,,,,,0,,,,,T,terres,,,2580,-0.057978,47.200081
2019-742298,2019-05-27,000002,Vente,61900,,,LES PLANTES,B252,49260,49060,Bellevigne-les-Châteaux,49,,,49060274ZB0026,,,,,,,,,,,,,0,,,,,VI,vignes,,,3040,-0.057978,47.200081
2019-742298,2019-05-27,000002,Vente,61900,,,LES PLANTES,B252,49260,49060,Bellevigne-les-Châteaux,49,,,49060274ZB0319,,,,,,,,,,,,,0,,,,,VI,vignes,,,734,-0.057547,47.200306
2019-742315,2019-05-21,000001,Vente,18268,,,LA BONNE (CHACE),B006,49400,49060,Bellevigne-les-Châteaux,49,,,49060000ZB0204,,,,,,,,,,,,,0,,,,,T,terres,,,9134,-0.065824,47.208085
2019-742321,2019-05-27,000001,Vente,525.2,,,LES ZIONNES,B064,49400,49060,Bellevigne-les-Châteaux,49,,,490600000E0830,,,,,,,,,,,,,0,,,,,T,terres,,,968,-0.073879,47.211578
2019-742321,2019-05-27,000001,Vente,525.2,,,LES ZIONNES,B064,49400,49060,Bellevigne-les-Châteaux,49,,,490600000E0832,,,,,,,,,,,,,0,,,,,BT,taillis simples,,,345,-0.073883,47.211296
2019-742327,2019-05-09,000001,Echange,1200,,,CLOS CHABOT,B015,49400,49060,Bellevigne-les-Châteaux,49,,,490600000A0005,,,,,,,,,,,,,0,,,,,VI,vignes,,,544,-0.075012,47.229979
2019-742328,2019-05-09,000002,Echange,3440,,,CLOS CHABOT,B015,49400,49060,Bellevigne-les-Châteaux,49,,,490600000A0047,,,,,,,,,,,,,0,,,,,VI,vignes,,,1561,-0.074348,47.226768
2019-742431,2019-05-21,000001,Vente,6500,,,LA GARENNE,B135,49260,49060,Bellevigne-les-Châteaux,49,,,49060046AD0256,,,,,,,,,,,,,0,,,,,VI,vignes,,,5202,-0.030907,47.173243
2019-742431,2019-05-21,000001,Vente,6500,,,LA GARENNE,B135,49260,49060,Bellevigne-les-Châteaux,49,,,49060046AD0268,,,,,,,,,,,,,0,,,,,BT,taillis simples,,,609,-0.03046,47.17429
2019-742487,2019-06-04,000002,Echange,2125,,,LES CLOS LIZIERES,B018,49400,49060,Bellevigne-les-Châteaux,49,,,490600000C0424,,,,,,,,,,,,,0,,,,,T,terres,,,850,-0.045598,47.212638
2019-742644,2019-06-21,000001,Vente,150000,18,,ALL DES TILLEULS (CHACE),0440,49400,49060,Bellevigne-les-Châteaux,49,,,49060000AD0009,,,,,,,,,,,,,0,1,Maison,90,5,S,sols,,,705,-0.065446,47.217056
2019-742644,2019-06-21,000001,Vente,150000,18,,ALL DES TILLEULS (CHACE),0440,49400,49060,Bellevigne-les-Châteaux,49,,,49060000AD0009,,,,,,,,,,,,,0,1,Maison,90,5,J,jardins,POTAG,Jardin potager,643,-0.065446,47.217056
2019-742659,2019-06-27,000001,Vente,125000,5,,RUE DES TILLEULS (BREZE),4250,49260,49060,Bellevigne-les-Châteaux,49,,,49060046ZA0616,,,,,,,,,,,,,0,1,Maison,88,5,S,sols,,,775,-0.065027,47.172683
2019-742669,2019-06-21,000001,Vente,3000,,,LES DINETRES,B121,49260,49060,Bellevigne-les-Châteaux,49,,,49060046ZB0273,,,,,,,,,,,,,0,,,,,T,terres,,,712,-0.052628,47.180797
2019-742669,2019-06-21,000001,Vente,3000,,,LES DINETRES,B121,49260,49060,Bellevigne-les-Châteaux,49,,,49060046ZB0275,,,,,,,,,,,,,0,,,,,T,terres,,,1001,-0.052147,47.180694
2019-742669,2019-06-21,000001,Vente,3000,,,LES DINETRES,B121,49260,49060,Bellevigne-les-Châteaux,49,,,49060046ZB0279,,,,,,,,,,,,,0,,,,,T,terres,,,568,-0.051554,47.181045
2019-742669,2019-06-21,000001,Vente,3000,,,LES DINETRES,B121,49260,49060,Bellevigne-les-Châteaux,49,,,49060046ZB0316,,,,,,,,,,,,,0,,,,,T,terres,,,291,-0.052512,47.179916
2019-742670,2019-06-26,000001,Vente,562,,,LES RUAUX (CHACE),B053,49400,49060,Bellevigne-les-Châteaux,49,,,490600000F0069,,,,,,,,,,,,,0,,,,,BT,taillis simples,,,352,-0.07926,47.192966
2019-742677,2019-07-04,000001,Vente,170000,31,,RUE DES SUREAUX (BREZE),4248,49260,49060,Bellevigne-les-Châteaux,49,,,49060046ZD0203,,,,,,,,,,,,,0,1,Maison,136,5,S,sols,,,1000,-0.05681,47.166698
2019-742712,2019-07-01,000001,Vente,290000,3,,RUE DE LA PROVIDENCE,4239,49260,49060,Bellevigne-les-Châteaux,49,,,49060046ZA0581,,,,,,,,,,,,,0,1,Maison,154,7,S,sols,,,980,-0.060274,47.176823
2019-742712,2019-07-01,000001,Vente,290000,3,,RUE DE LA PROVIDENCE,4239,49260,49060,Bellevigne-les-Châteaux,49,,,49060046ZA0581,,,,,,,,,,,,,0,1,Maison,154,7,AG,terrains d'agrément,,,4400,-0.060274,47.176823
2019-742750,2019-07-12,000001,Vente,115000,24,,RUE DES AMANDIERS,4211,49260,49060,Bellevigne-les-Châteaux,49,,,49060046ZA0591,,,,,,,,,,,,,0,1,Maison,82,4,S,sols,,,800,-0.063639,47.175193
2019-742750,2019-07-12,000001,Vente,115000,24,,RUE DES AMANDIERS,4211,49260,49060,Bellevigne-les-Châteaux,49,,,49060046ZA0591,,,,,,,,,,,,,0,1,Maison,82,4,J,jardins,POTAG,Jardin potager,700,-0.063639,47.175193
2019-742768,2019-07-12,000001,Vente,750,,,L EPINAY,B126,49260,49060,Bellevigne-les-Châteaux,49,,,49060046ZA0798,,,,,,,,,,,,,0,,,,,T,terres,,,38,-0.064134,47.185957
2019-742768,2019-07-12,000001,Vente,750,,,L EPINAY,B126,49260,49060,Bellevigne-les-Châteaux,49,,,49060046ZA0799,,,,,,,,,,,,,0,,,,,T,terres,,,742,-0.063968,47.185495
2019-742786,2019-06-25,000001,Vente,130000,5488,,RUE DES TILLEULS (BREZE),4250,49260,49060,Bellevigne-les-Châteaux,49,,,49060046ZA0636,,,,,,,,,,,,,0,1,Maison,78,4,S,sols,,,634,-0.067423,47.172061
2019-742829,2019-07-24,000001,Vente,235000,34,,ALL DES ERABLES,0210,49400,49060,Bellevigne-les-Châteaux,49,,,49060000AC0047,,,,,,,,,,,,,0,1,Maison,148,7,S,sols,,,689,-0.06929,47.213419
2019-742829,2019-07-24,000001,Vente,235000,,,ALL DES ERABLES,0210,49400,49060,Bellevigne-les-Châteaux,49,,,49060000AC0048,,,,,,,,,,,,,0,,,,,S,sols,,,57,-0.069657,47.213496
2019-742844,2019-07-26,000001,Vente,95000,7,,RUE DU PRIEURE (ST CYR),4289,49260,49060,Bellevigne-les-Châteaux,49,,,49060274ZB0255,,,,,,,,,,,,,0,1,Maison,74,4,S,sols,,,663,-0.055646,47.196223
2019-742865,2019-07-03,000001,Vente,670,,,LES DINETRES,B121,49260,49060,Bellevigne-les-Châteaux,49,,,49060046ZB0278,,,,,,,,,,,,,0,,,,,VI,vignes,,,422,-0.051889,47.180448
2019-742865,2019-07-03,000001,Vente,670,,,LES DINETRES,B121,49260,49060,Bellevigne-les-Châteaux,49,,,49060046ZB0278,,,,,,,,,,,,,0,,,,,VI,vignes,,,140,-0.051889,47.180448
2019-742894,2019-07-30,000001,Vente,139000,34,,RUE DES VIGNES (BREZE),4253,49260,49060,Bellevigne-les-Châteaux,49,,,49060046ZH0220,,,,,,,,,,,,,0,,,,,S,sols,,,13,-0.05937,47.168061
2019-742894,2019-07-30,000001,Vente,139000,34,,RUE DES VIGNES (BREZE),4253,49260,49060,Bellevigne-les-Châteaux,49,,,49060046ZH0221,,,,,,,,,,,,,0,1,Maison,82,3,S,sols,,,675,-0.059569,47.167933
2019-742902,2019-03-06,000001,Vente,40000,,,ALL DES ERABLES,0210,49400,49060,Bellevigne-les-Châteaux,49,,,49060000AC0284,,,,,,,,,,,,,0,,,,,S,sols,,,567,-0.070362,47.213678
2019-742902,2019-03-06,000001,Vente,40000,,,ALL DES ERABLES,0210,49400,49060,Bellevigne-les-Châteaux,49,,,49060000AC0286,,,,,,,,,,,,,0,,,,,S,sols,,,153,-0.070529,47.21368
2019-742902,2019-03-06,000001,Vente,40000,,,ALL DES ERABLES,0210,49400,49060,Bellevigne-les-Châteaux,49,,,49060000AC0288,,,,,,,,,,,,,0,,,,,S,sols,,,205,-0.070406,47.213751
2019-742902,2019-03-06,000002,Vente,40000,,,ALL DES ERABLES,0210,49400,49060,Bellevigne-les-Châteaux,49,,,49060000AC0284,,,,,,,,,,,,,0,,,,,S,sols,,,567,-0.070362,47.213678
2019-742902,2019-03-06,000002,Vente,40000,,,ALL DES ERABLES,0210,49400,49060,Bellevigne-les-Châteaux,49,,,49060000AC0286,,,,,,,,,,,,,0,,,,,S,sols,,,153,-0.070529,47.21368
2019-742902,2019-03-06,000002,Vente,40000,,,ALL DES ERABLES,0210,49400,49060,Bellevigne-les-Châteaux,49,,,49060000AC0288,,,,,,,,,,,,,0,,,,,S,sols,,,205,-0.070406,47.213751
2019-742918,2019-07-22,000001,Vente,1000,,,LES SALLES MARTIN,B255,49260,49060,Bellevigne-les-Châteaux,49,,,49060274AC0239,,,,,,,,,,,,,0,,,,,VI,vignes,,,470,-0.062234,47.191941
2019-742919,2019-07-22,000001,Vente,55000,,,SOUS TIRON (BREZE),B192,49260,49060,Bellevigne-les-Châteaux,49,,,49060046ZA0144,,,,,,,,,,,,,0,,,,,T,terres,,,5680,-0.0606,47.181206
2019-742919,2019-07-22,000001,Vente,55000,,,LES CHAMPS IENS,B100,49260,49060,Bellevigne-les-Châteaux,49,,,49060046ZA0371,,,,,,,,,,,,,0,,,,,T,terres,,,23120,-0.068406,47.178466
2019-742919,2019-07-22,000001,Vente,55000,,,LE CHAMP PICARD (BREZE),B099,49260,49060,Bellevigne-les-Châteaux,49,,,49060046ZC0393,,,,,,,,,,,,,0,,,,,VI,vignes,,,834,-0.040771,47.174732
2019-742930,2019-07-19,000001,Vente,55000,3,,RUE EMILE LANDAIS (CHACE),0200,49400,49060,Bellevigne-les-Châteaux,49,,,49060000AB0242,,,11,44.75,,,,,,,,,1,2,Appartement,44,2,,,,,,-0.069003,47.217716
2019-742951,2019-07-17,000001,Vente,682684.2,9000,F,RTE DE CHACE,4280,49260,49060,Bellevigne-les-Châteaux,49,,,49060274ZB0360,,,,,,,,,,,,,0,4,Local industriel. commercial ou assimilé,,0,T,terres,,,1475,-0.060177,47.199467
2019-742968,2019-07-29,000001,Vente,166000,65,,RUE DE L AMIRAL MAILLE BREZE,4212,49260,49060,Bellevigne-les-Châteaux,49,,,49060046ZA0454,,,,,,,,,,,,,0,1,Maison,91,5,S,sols,,,1000,-0.060964,47.179852
2019-742968,2019-07-29,000001,Vente,166000,65,,RUE DE L AMIRAL MAILLE BREZE,4212,49260,49060,Bellevigne-les-Châteaux,49,,,49060046ZA0454,,,,,,,,,,,,,0,1,Maison,91,5,J,jardins,POTAG,Jardin potager,1000,-0.060964,47.179852
2019-742972,2019-08-01,000001,Vente,54300,,,LES COUDREAUX (ST CYR),B234,49260,49060,Bellevigne-les-Châteaux,49,,,49060274ZA0045,,,,,,,,,,,,,0,,,,,T,terres,,,6820,-0.060333,47.205625
2019-742972,2019-08-01,000001,Vente,54300,,,GATE ARGENT (ST CYR),B237,49260,49060,Bellevigne-les-Châteaux,49,,,49060274ZA0219,,,,,,,,,,,,,0,,,,,T,terres,,,10440,-0.050345,47.202656
2019-742972,2019-08-01,000001,Vente,54300,,,LES TUFFELAIS,B059,49400,49060,Bellevigne-les-Châteaux,49,,,49060000ZC0133,,,,,,,,,,,,,0,,,,,T,terres,,,8770,-0.060433,47.206304
2019-742972,2019-08-01,000001,Vente,54300,,,LES TUFFELAIS,B059,49400,49060,Bellevigne-les-Châteaux,49,,,49060000ZC0134,,,,,,,,,,,,,0,,,,,T,terres,,,30090,-0.061845,47.207073
2019-742972,2019-08-01,000001,Vente,54300,,,GATE ARGENT (CHACE),B030,49400,49060,Bellevigne-les-Châteaux,49,,,49060000ZC0467,,,,,,,,,,,,,0,,,,,T,terres,,,15000,-0.049561,47.202752
2019-743016,2019-08-02,000001,Vente,85000,12,,LE MOUTIER (ST CYR),B245,49260,49060,Bellevigne-les-Châteaux,49,,,49060274ZB0206,,,,,,,,,,,,,0,1,Maison,88,4,S,sols,,,760,-0.055733,47.197534
2019-743080,2019-08-08,000001,Vente,3427,5,,RUE DE LA DOUVE,0160,49400,49060,Bellevigne-les-Châteaux,49,,,49060000AA0240,,,,,,,,,,,,,0,,,,,S,sols,,,149,-0.076428,47.216768
2019-743185,2019-09-03,000001,Vente,2500,,,LE CHAMP DU TOIT,B012,49400,49060,Bellevigne-les-Châteaux,49,,,490600000A0780,,,,,,,,,,,,,0,,,,,T,terres,,,510,-0.07834,47.217421
2019-743186,2019-09-03,000001,Vente,171000,,,LE BOURG (BREZE),B092,49260,49060,Bellevigne-les-Châteaux,49,,,49060046AB0528,,,,,,,,,,,,,0,,,,,S,sols,,,143,-0.05472,47.170116
2019-743186,2019-09-03,000001,Vente,171000,,,IMP AUX SUREAUX (BREZE),4262,49260,49060,Bellevigne-les-Châteaux,49,,,49060046AB0531,,,,,,,,,,,,,0,,,,,S,sols,,,295,-0.055155,47.170082
2019-743186,2019-09-03,000001,Vente,171000,2,,IMP AUX SUREAUX (BREZE),4262,49260,49060,Bellevigne-les-Châteaux,49,,,49060046AB0534,,,,,,,,,,,,,0,1,Maison,105,4,S,sols,,,795,-0.055492,47.170022
2019-743280,2019-09-18,000001,Vente,172500,2,,RUE DE LA CAVE HERPIN,4267,49260,49060,Bellevigne-les-Châteaux,49,,,49060274AB0291,,,,,,,,,,,,,0,1,Maison,129,6,S,sols,,,307,,
2019-743430,2019-09-20,000002,Vente,1,39,,RUE DE L AMIRAL MAILLE BREZE,4212,49260,49060,Bellevigne-les-Châteaux,49,,,49060046ZA0843,,,,,,,,,,,,,0,,,,,S,sols,,,8,-0.060694,47.176051