id_mutation,date_mutation,numero_disposition,nature_mutation,valeur_fonciere,adresse_numero,adresse_suffixe,adresse_nom_voie,adresse_code_voie,code_postal,code_commune,nom_commune,code_departement,ancien_code_commune,ancien_nom_commune,id_parcelle,ancien_id_parcelle,numero_volume,lot1_numero,lot1_surface_carrez,lot2_numero,lot2_surface_carrez,lot3_numero,lot3_surface_carrez,lot4_numero,lot4_surface_carrez,lot5_numero,lot5_surface_carrez,nombre_lots,code_type_local,type_local,surface_reelle_bati,nombre_pieces_principales,code_nature_culture,nature_culture,code_nature_culture_speciale,nature_culture_speciale,surface_terrain,longitude,latitude
2019-756717,2019-01-15,000002,Vente,1000,,,LE JARDIN DE DEVANT,B872,50510,50252,Hudimesnil,50,,,502520000A0690,,,,,,,,,,,,,0,,,,,L,landes,,,345,-1.456698,48.860972
2019-756717,2019-01-15,000002,Vente,1000,,,LE JARDIN DE DEVANT,B872,50510,50252,Hudimesnil,50,,,502520000A0940,,,,,,,,,,,,,0,,,,,PP,prés plantes,HERB,Herbage,243,-1.456825,48.860992
2019-756793,2019-01-16,000001,Vente,2200,,,LE CLOS SUR LE PRE,B717,50510,50252,Hudimesnil,50,,,502520000G0279,,,,,,,,,,,,,0,,,,,PP,prés plantes,HERB,Herbage,1708,-1.438645,48.879202
2019-756793,2019-01-16,000001,Vente,2200,,,LE COSTIL,B759,50510,50252,Hudimesnil,50,,,502520000G0280,,,,,,,,,,,,,0,,,,,BT,taillis simples,,,1739,-1.438234,48.879215
2019-756793,2019-01-16,000001,Vente,2200,,,LE PRE DE CORBIGNY,C278,50510,50252,Hudimesnil,50,,,502520000G0284,,,,,,,,,,,,,0,,,,,P,prés,,,466,-1.437977,48.879078
2019-756913,2019-01-29,000001,Vente,90476,,,LE PRE DE L ETANG,C160,50510,50252,Hudimesnil,50,,,502520000A0639,,,,,,,,,,,,,0,,,,,P,prés,,,3230,-1.454477,48.856471
2019-756913,2019-01-29,000001,Vente,90476,,,LE PRE DE L ETANG,C160,50510,50252,Hudimesnil,50,,,502520000A0640,,,,,,,,,,,,,0,,,,,P,prés,,,2673,-1.455307,48.856897
2019-756913,2019-01-29,000001,Vente,90476,,,LE PRE DU MOULIN,C175,50510,50252,Hudimesnil,50,,,502520000B0380,,,,,,,,,,,,,0,,,,,BT,taillis simples,,,2970,-1.457593,48.856441
2019-756913,2019-01-29,000001,Vente,90476,,,LE PRE DU MOULIN,C175,50510,50252,Hudimesnil,50,,,502520000B0901,,,,,,,,,,,,,0,,,,,P,prés,,,1800,-1.455842,48.856585
2019-756913,2019-01-29,000001,Vente,90476,,,LE PRE DU MOULIN,C175,50510,50252,Hudimesnil,50,,,502520000B0902,,,,,,,,,,,,,0,,,,,P,prés,,,2190,-1.456519,48.856452
2019-757081,2019-03-01,000001,Vente,150000,,,LA COMMUNE,B092,50510,50252,Hudimesnil,50,,,502520000D0228,,,,,,,,,,,,,0,,,,,P,prés,,,2739,-1.501718,48.872317
2019-757081,2019-03-01,000001,Vente,150000,,,LE BAS DES CHAMPS,B427,50510,50252,Hudimesnil,50,,,502520000D0535,,,,,,,,,,,,,0,,,,,S,sols,,,114,-1.501286,48.871882
2019-757081,2019-03-01,000001,Vente,150000,,,LA BOUCHERIE,B069,50510,50252,Hudimesnil,50,,,502520000D0536,,,,,,,,,,,,,0,,,,,J,jardins,,,537,-1.501323,48.871994
2019-757081,2019-03-01,000001,Vente,150000,5194,,LA BOUCHERIE,B069,50510,50252,Hudimesnil,50,,,502520000D0537,,,,,,,,,,,,,0,1,Maison,75,4,S,sols,,,403,-1.501258,48.872138
2019-757109,2019-02-16,000001,Vente,31000,,,LA CROUTE DU GRANVILLAIS,B103,50510,50252,Hudimesnil,50,,,502520000A0004,,,,,,,,,,,,,0,,,,,PP,prés plantes,HERB,Herbage,9103,-1.464754,48.872889
2019-757109,2019-02-16,000001,Vente,31000,,,LE CLOS DE LA TOUGUE,B494,50510,50252,Hudimesnil,50,,,502520000A0006,,,,,,,,,,,,,0,,,,,PP,prés plantes,HERB,Herbage,8554,-1.463819,48.872452
2019-757109,2019-02-16,000001,Vente,31000,,,LE CLOS DE LA TOUGUE,B494,50510,50252,Hudimesnil,50,,,502520000A0007,,,,,,,,,,,,,0,,,,,PP,prés plantes,HERB,Herbage,9832,-1.462922,48.872278
2019-757109,2019-02-16,000001,Vente,31000,,,LE GESOUR,B790,50510,50252,Hudimesnil,50,,,502520000A0176,,,,,,,,,,,,,0,,,,,PP,prés plantes,HERB,Herbage,6117,-1.463018,48.871053
2019-757109,2019-02-16,000001,Vente,31000,,,LE GESOUR,B790,50510,50252,Hudimesnil,50,,,502520000A0177,,,,,,,,,,,,,0,,,,,PP,prés plantes,HERB,Herbage,5893,-1.4629,48.871521
2019-757180,2019-03-08,000002,Vente,9700,,,LE CLOS ALLIX DE BAS,B593,50510,50252,Hudimesnil,50,,,502520000B1361,,,,,,,,,,,,,0,,,,,S,sols,,,139,-1.491608,48.859516
2019-757180,2019-03-08,000002,Vente,9700,,,LE CLOS ALLIX DE BAS,B593,50510,50252,Hudimesnil,50,,,502520000B1365,,,,,,,,,,,,,0,,,,,PP,prés plantes,HERB,Herbage,400,-1.491531,48.859341
2019-757180,2019-03-08,000002,Vente,9700,,,LE CLOS ALLIX DE BAS,B593,50510,50252,Hudimesnil,50,,,502520000B1367,,,,,,,,,,,,,0,,,,,PP,prés plantes,HERB,Herbage,75,-1.491445,48.859472
2019-757298,2019-03-27,000001,Vente,7750,,,LA LANDE DU VILLAGE DE HAU,B246,50510,50252,Hudimesnil,50,,,502520000B0378,,,,,,,,,,,,,0,,,,,BT,taillis simples,,,10597,-1.458784,48.857829
2019-757598,2019-05-03,000001,Vente,600,,,LA FIEFFE BULLOT,B149,50510,50252,Hudimesnil,50,,,502520000B0757,,,,,,,,,,,,,0,,,,,PP,prés plantes,HERB,Herbage,2550,-1.484025,48.858226
2019-757796,2019-03-26,000002,Vente,50000,5065,,VILLAGE L ENFANT,C468,50510,50252,Hudimesnil,50,,,502520000B1370,,,,,,,,,,,,,0,1,Maison,65,5,,,,,,-1.480116,48.862734
2019-757832,2019-05-23,000001,Vente,46000,,,LA BRETONNIERE,B072,50510,50252,Hudimesnil,50,,,502520000B0269,,,,,,,,,,,,,0,,,,,J,jardins,,,540,-1.469024,48.864614
2019-757832,2019-05-23,000001,Vente,46000,5170,,LA BRETONNIERE,B072,50510,50252,Hudimesnil,50,,,502520000B0270,,,,,,,,,,,,,0,1,Maison,50,1,S,sols,,,310,-1.468816,48.864689
2019-757845,2019-05-23,000002,Vente,800,,,LE PRE ERNOUF,C174,50510,50252,Hudimesnil,50,,,502520000B1368,,,,,,,,,,,,,0,,,,,P,prés,,,118,-1.468873,48.864792
2019-757963,2019-07-03,000001,Vente,165000,5186,A,LE VILLAGE DU DINOT,C336,50510,50252,Hudimesnil,50,,,502520000C0447,,,,,,,,,,,,,0,1,Maison,100,5,S,sols,,,1120,-1.492122,48.860295
2019-757963,2019-07-03,000001,Vente,165000,,,LE JARDIN DE DERRIERE,B878,50510,50252,Hudimesnil,50,,,502520000C0448,,,,,,,,,,,,,0,,,,,PP,prés plantes,HERB,Herbage,154,-1.492295,48.860091
2019-758011,2019-06-27,000001,Vente,14000,,,LE COSTIL,B759,50510,50252,Hudimesnil,50,,,502520000G0075,,,,,,,,,,,,,0,,,,,PP,prés plantes,HERB,Herbage,9070,-1.461363,48.877222
2019-758011,2019-06-27,000001,Vente,14000,,,VILLAGE RINGY,C475,50510,50252,Hudimesnil,50,,,502520000G0126,,,,,,,,,,,,,0,,,,,T,terres,,,5533,-1.461399,48.878717
2019-758011,2019-06-27,000001,Vente,14000,,,VILLAGE RINGY,C475,50510,50252,Hudimesnil,50,,,502520000G0712,,,,,,,,,,,,,0,,,,,T,terres,,,5516,-1.461407,48.879029
2019-758019,2019-07-03,000001,Vente,2000,,,LE CLOS DES LOGIS,B595,50510,50252,Hudimesnil,50,,,502520000B0549,,,,,,,,,,,,,0,,,,,PP,prés plantes,HERB,Herbage,2906,-1.487882,48.858429
2019-758161,2019-07-06,000001,Vente,15660,,,LA VERANDE,B401,50510,50252,Hudimesnil,50,,,502520000E0027,,,,,,,,,,,,,0,,,,,PP,prés plantes,HERB,Herbage,3891,-1.481703,48.874691
2019-758161,2019-07-06,000001,Vente,15660,,,LE CLOS DE HAUT,B518,50510,50252,Hudimesnil,50,,,502520000E0150,,,,,,,,,,,,,0,,,,,PP,prés plantes,HERB,Herbage,7160,-1.481046,48.874252
2019-758161,2019-07-06,000001,Vente,15660,,,LE GRAND JARDIN,B796,50510,50252,Hudimesnil,50,,,502520000E0151,,,,,,,,,,,,,0,,,,,PP,prés plantes,HERB,Herbage,11320,-1.480557,48.873369
2019-758253,2019-07-16,000001,Vente,147000,,,LE HAUT DU BOURG,B860,50510,50252,Hudimesnil,50,,,502520000C0587,,,,,,,,,,,,,0,1,Maison,90,5,PP,prés plantes,HERB,Herbage,2179,-1.492296,48.864441
2019-758253,2019-07-16,000001,Vente,147000,,,LE HAUT DU BOURG,B860,50510,50252,Hudimesnil,50,,,502520000C0587,,,,,,,,,,,,,0,1,Maison,90,5,S,sols,,,500,-1.492296,48.864441
2019-758370,2019-08-27,000001,Vente,132500,5083,,LA CROIX AUBERT,B105,50510,50252,Hudimesnil,50,,,502520000A0865,,,,,,,,,,,,,0,1,Maison,69,3,S,sols,,,920,-1.44615,48.866881
2019-758382,2019-08-23,000001,Vente,82500,9021,,LES TERRES ALIX,C436,50510,50252,Hudimesnil,50,,,502520000C0839,,,,,,,,,,,,,0,1,Maison,40,3,S,sols,,,246,-1.497558,48.858738
2019-758497,2019-08-26,000001,Vente,297000,1,,LA BOUGONNIERE,B068,50510,50252,Hudimesnil,50,,,502520000C0595,,,,,,,,,,,,,0,1,Maison,140,5,S,sols,,,500,-1.487882,48.862748
2019-758497,2019-08-26,000001,Vente,297000,1,,LA BOUGONNIERE,B068,50510,50252,Hudimesnil,50,,,502520000C0595,,,,,,,,,,,,,0,1,Maison,140,5,AG,terrains d'agrément,,,536,-1.487882,48.862748
2019-758511,2019-08-16,000001,Vente,55000,,,LA CHAPELLE,B082,50510,50252,Hudimesnil,50,,,502520000B0744,,,,,,,,,,,,,0,,,,,J,jardins,,,1196,-1.483022,48.853361
2019-758511,2019-08-16,000001,Vente,55000,,,LE CLOS DE LA BOULANGERIE,B615,50510,50252,Hudimesnil,50,,,502520000B1170,,,,,,,,,,,,,0,,,,,PP,prés plantes,HERB,Herbage,9383,-1.482264,48.852793
2019-758511,2019-08-16,000001,Vente,55000,5044,D,LA CHAPELLE,B082,50510,50252,Hudimesnil,50,,,502520000B1212,,,,,,,,,,,,,0,1,Maison,94,0,S,sols,,,670,-1.483497,48.853085
2019-758733,2019-09-18,000002,Vente,260000,,,LA PETITE TAPINIERE,B334,50510,50252,Hudimesnil,50,,,502520000F0500,,,,,,,,,,,,,0,,,,,J,jardins,,,970,-1.472186,48.886313
2019-758733,2019-09-18,000002,Vente,260000,,,LA PETITE TAPINIERE,B334,50510,50252,Hudimesnil,50,,,502520000F0501,,,,,,,,,,,,,0,,,,,J,jardins,,,1,-1.472558,48.886138
2019-758733,2019-09-18,000002,Vente,260000,5220,,LA PETITE TAPINIERE,B334,50510,50252,Hudimesnil,50,,,502520000F0502,,,,,,,,,,,,,0,1,Maison,266,8,S,sols,,,584,-1.472068,48.886151
2019-758733,2019-09-18,000002,Vente,260000,,,LA PETITE TAPINIERE,B334,50510,50252,Hudimesnil,50,,,502520000F0504,,,,,,,,,,,,,0,,,,,S,sols,,,185,-1.472273,48.886101
2019-758733,2019-09-18,000002,Vente,260000,,,LA GRANDE BERGUERIE,B205,50510,50252,Hudimesnil,50,,,502520000F0505,,,,,,,,,,,,,0,,,,,PP,prés plantes,HERB,Herbage,3147,-1.471701,48.886385
2019-758733,2019-09-18,000002,Vente,260000,,,LA PETITE TAPINIERE,B334,50510,50252,Hudimesnil,50,,,502520000F0509,,,,,,,,,,,,,0,,,,,S,sols,,,4,-1.471977,48.886065
2019-758733,2019-09-18,000002,Vente,260000,,,LA PETITE TAPINIERE,B334,50510,50252,Hudimesnil,50,,,502520000F0510,,,,,,,,,,,,,0,,,,,S,sols,,,7,-1.472543,48.886083
2019-758733,2019-09-18,000002,Vente,260000,,,LA PETITE TAPINIERE,B334,50510,50252,Hudimesnil,50,,,502520000F0511,,,,,,,,,,,,,0,,,,,PP,prés plantes,HERB,Herbage,8306,-1.470567,48.886178
2019-759098,2019-10-23,000001,Vente,8000,,,LE PRE DE LA GOSNE,C233,50510,50252,Hudimesnil,50,,,502520000D0332,,,,,,,,,,,,,0,,,,,BP,peupleraies,,,11950,-1.488997,48.876061
2019-759098,2019-10-23,000001,Vente,8000,,,LE GRAND PRE,B795,50510,50252,Hudimesnil,50,,,502520000D0351,,,,,,,,,,,,,0,,,,,BP,peupleraies,,,2075,-1.487697,48.875241
2019-759151,2019-11-02,000001,Vente,5000,,,LE CLOS DU BOIS,B499,50510,50252,Hudimesnil,50,,,502520000A0128,,,,,,,,,,,,,0,,,,,PP,prés plantes,HERB,Herbage,5600,-1.460816,48.866004
2019-759151,2019-11-02,000001,Vente,5000,,,LE BOIS DONTOT,B437,50510,50252,Hudimesnil,50,,,502520000A0706,,,,,,,,,,,,,0,,,,,BT,taillis simples,,,4425,-1.460346,48.866763
2019-759152,2019-11-19,000001,Vente,2653,,,LE PETIT FAUDAIS,C093,50510,50252,Hudimesnil,50,,,502520000B0105,,,,,,,,,,,,,0,,,,,PP,prés plantes,HERB,Herbage,3517,-1.476295,48.868809
2019-759152,2019-11-19,000001,Vente,2653,,,LE PRE VAULEE,C168,50510,50252,Hudimesnil,50,,,502520000B0123,,,,,,,,,,,,,0,,,,,P,prés,,,1306,-1.48164,48.870331
2019-759223,2019-11-16,000001,Vente,222500,5002,B,LE HAUT DU BOURG,B860,50510,50252,Hudimesnil,50,,,502520000C0523,,,,,,,,,,,,,0,1,Maison,143,6,AG,terrains d'agrément,,,731,-1.493445,48.863832
2019-759223,2019-11-16,000001,Vente,222500,5002,B,LE HAUT DU BOURG,B860,50510,50252,Hudimesnil,50,,,502520000C0523,,,,,,,,,,,,,0,1,Maison,143,6,S,sols,,,500,-1.493445,48.863832
2019-759236,2019-12-05,000001,Vente,277500,5193,,VILLAGE HERICE,C471,50510,50252,Hudimesnil,50,,,502520000D0242,,,,,,,,,,,,,0,1,Maison,84,4,S,sols,,,1315,-1.500424,48.87456
2019-759236,2019-12-05,000001,Vente,277500,,,LA CEINTURE,B078,50510,50252,Hudimesnil,50,,,502520000D0584,,,,,,,,,,,,,0,,,,,PP,prés plantes,HERB,Herbage,34,-1.500696,48.874351
2019-759236,2019-12-05,000001,Vente,277500,,,VILLAGE HERICE,C471,50510,50252,Hudimesnil,50,,,502520000D0587,,,,,,,,,,,,,0,,,,,J,jardins,,,738,-1.50006,48.874727
2019-759236,2019-12-05,000001,Vente,277500,,,LA CEINTURE,B078,50510,50252,Hudimesnil,50,,,502520000D0588,,,,,,,,,,,,,0,,,,,PP,prés plantes,HERB,Herbage,1075,-1.500276,48.874489
2019-759236,2019-12-05,000001,Vente,277500,,,LA GOUTIERE,B163,50510,50252,Hudimesnil,50,,,502520000D0590,,,,,,,,,,,,,0,,,,,PP,prés plantes,HERB,Herbage,255,-1.500181,48.874827
2019-759236,2019-12-05,000001,Vente,277500,,,LA CEINTURE,B078,50510,50252,Hudimesnil,50,,,502520000D0619,,,,,,,,,,,,,0,,,,,PP,prés plantes,HERB,Herbage,399,-1.500667,48.874275
2019-759236,2019-12-05,000001,Vente,277500,,,LA CEINTURE,B078,50510,50252,Hudimesnil,50,,,502520000D0621,,,,,,,,,,,,,0,,,,,PP,prés plantes,HERB,Herbage,2361,-1.499907,48.874563
2019-759294,2019-12-04,000001,Vente,210000,5060,B,LE BOURG,B462,50510,50252,Hudimesnil,50,,,502520000C0521,,,,,,,,,,,,,0,1,Maison,122,6,S,sols,,,918,-1.494381,48.863579
2019-759300,2019-11-29,000001,Vente,40000,9026,,LES TERRES ALIX,C436,50510,50252,Hudimesnil,50,,,502520000C1117,,,,,,,,,,,,,0,1,Maison,58,4,S,sols,,,272,-1.495942,48.858099
2019-759363,2019-11-30,000001,Vente,127000,,,LA GRANDE TAPINIERE,B204,50510,50252,Hudimesnil,50,,,502520000F0067,,,,,,,,,,,,,0,,,,,J,jardins,,,475,-1.470561,48.888598
2019-759363,2019-11-30,000001,Vente,127000,,,LA GRANDE TAPINIERE,B204,50510,50252,Hudimesnil,50,,,502520000F0070,,,,,,,,,,,,,0,,,,,PP,prés plantes,HERB,Herbage,9989,-1.469886,48.888626
2019-759363,2019-11-30,000001,Vente,127000,,,LA GRANDE TAPINIERE,B204,50510,50252,Hudimesnil,50,,,502520000F0336,,,,,,,,,,,,,0,,,,,S,sols,,,16,-1.470354,48.888893
2019-759363,2019-11-30,000001,Vente,127000,,,LE JARDIN,B866,50510,50252,Hudimesnil,50,,,502520000F0470,,,,,,,,,,,,,0,,,,,PP,prés plantes,HERB,Herbage,1495,-1.469929,48.889318
2019-759363,2019-11-30,000001,Vente,127000,,,LE JARDIN,B866,50510,50252,Hudimesnil,50,,,502520000F0471,,,,,,,,,,,,,0,,,,,PP,prés plantes,HERB,Herbage,1471,-1.470072,48.889049
2019-759363,2019-11-30,000001,Vente,127000,8,,LA GRANDE TAPINIERE,B204,50510,50252,Hudimesnil,50,,,502520000F0476,,,,,,,,,,,,,0,1,Maison,72,3,S,sols,,,567,-1.470458,48.88878
2019-759366,2019-12-13,000001,Vente,110000,,,LE JARDIN DE LA BOULANGERI,B888,50510,50252,Hudimesnil,50,,,502520000A0433,,,,,,,,,,,,,0,,,,,J,jardins,,,1110,-1.436239,48.861414
2019-759366,2019-12-13,000001,Vente,110000,5102,,LA HAUTE MARCHE,B211,50510,50252,Hudimesnil,50,,,502520000A0435,,,,,,,,,,,,,0,1,Maison,105,4,S,sols,,,1353,-1.4365,48.861604
2019-759366,2019-12-13,000001,Vente,110000,,,LA HAUTE MARCHE,B211,50510,50252,Hudimesnil,50,,,502520000A0436,,,,,,,,,,,,,0,,,,,J,jardins,,,538,-1.436905,48.861678
2019-759381,2019-12-26,000001,Vente,446448,6,,LOT LE CLOS DU VERGER,A005,50510,50252,Hudimesnil,50,,,502520000B1307,,,,,,,,,,,,,0,1,Maison,130,5,S,sols,,,856,-1.486362,48.860942
2019-759381,2019-12-26,000001,Vente,446448,,,LE CLOS DUFOUR,B597,50510,50252,Hudimesnil,50,,,502520000B1316,,,,,,,,,,,,,0,,,,,S,sols,,,49,-1.486375,48.861101
2019-759381,2019-12-26,000001,Vente,446448,,,LA NOE DE HAUT,B282,50510,50252,Hudimesnil,50,,,502520000B1317,,,,,,,,,,,,,0,,,,,PP,prés plantes,HERB,Herbage,677,-1.486133,48.8608
2019-759403,2019-12-19,000001,Vente,91.2,,,LA LANDE DU COURT CHAMP,B243,50510,50252,Hudimesnil,50,,,502520000B1324,,,,,,,,,,,,,0,,,,,S,sols,,,780,-1.459853,48.858934
2019-759424,2019-12-19,000001,Vente,39000,,,LA CROIX AUBERT,B105,50510,50252,Hudimesnil,50,,,502520000A0227,,,,,,,,,,,,,0,,,,,S,sols,,,78,-1.445292,48.865439
2019-759424,2019-12-19,000001,Vente,39000,,,LA CROIX AUBERT,B105,50510,50252,Hudimesnil,50,,,502520000A0935,,,,,,,,,,,,,0,,,,,PP,prés plantes,HERB,Herbage,1806,-1.445228,48.865528
2019-759470,2019-12-16,000001,Vente,128000,,,LE HAUT DE LA VALLEE ESTHO,B856,50510,50252,Hudimesnil,50,,,502520000B0037,,,,,,,,,,,,,0,,,,,PP,prés plantes,HERB,Herbage,160,-1.465273,48.868881
2019-759470,2019-12-16,000001,Vente,128000,,,LE HAUT DE LA VALLEE,B857,50510,50252,Hudimesnil,50,,,502520000B0337,,,,,,,,,,,,,0,,,,,PP,prés plantes,HERB,Herbage,978,-1.4651,48.868718
2019-759470,2019-12-16,000001,Vente,128000,,,LE HAUT DE LA VALLEE,B857,50510,50252,Hudimesnil,50,,,502520000B1120,,,,,,,,,,,,,0,,,,,J,jardins,,,303,-1.464817,48.868575
2019-759470,2019-12-16,000001,Vente,128000,,,LA VALLEE ESTHORE,B392,50510,50252,Hudimesnil,50,,,502520000B1193,,,,,,,,,,,,,0,,,,,PP,prés plantes,HERB,Herbage,111,-1.465493,48.868838
2019-759470,2019-12-16,000001,Vente,128000,,,LE HAUT DE LA VALLEE,B857,50510,50252,Hudimesnil,50,,,502520000B1203,,,,,,,,,,,,,0,,,,,PP,prés plantes,HERB,Herbage,606,-1.465296,48.868623
2019-759470,2019-12-16,000001,Vente,128000,10,,LA VALLEE ESTHORE,B392,50510,50252,Hudimesnil,50,,,502520000B1204,,,,,,,,,,,,,0,1,Maison,50,3,S,sols,,,424,-1.464873,48.86843
2019-759470,2019-12-16,000001,Vente,128000,,,LE HAUT DE LA VALLEE,B857,50510,50252,Hudimesnil,50,,,502520000B1207,,,,,,,,,,,,,0,,,,,PP,prés plantes,HERB,Herbage,51,-1.464696,48.868412
2019-759523,2019-12-19,000001,Vente,100000,9001,,LA VALLEE ESTHORE,B392,50510,50252,Hudimesnil,50,,,502520000A0171,,,,,,,,,,,,,0,1,Maison,163,7,S,sols,,,600,-1.464104,48.870157
2019-759523,2019-12-19,000001,Vente,100000,9001,,LA VALLEE ESTHORE,B392,50510,50252,Hudimesnil,50,,,502520000A0171,,,,,,,,,,,,,0,1,Maison,163,7,AG,terrains d'agrément,,,1770,-1.464104,48.870157
2019-759534,2019-12-31,000001,Vente,1300,,,LE PRE DU PENDANT,C232,50510,50252,Hudimesnil,50,,,502520000D0330,,,,,,,,,,,,,0,,,,,P,prés,,,4308,-1.490668,48.877341
2019-759543,2019-12-20,000001,Vente,137100,16,,LES TERRES ALIX,C436,50510,50252,Hudimesnil,50,,,502520000C0196,,,,,,,,,,,,,0,1,Maison,85,3,S,sols,,,140,-1.493257,48.859385
2019-759543,2019-12-20,000001,Vente,137100,,,LES TERRES ALIX,C436,50510,50252,Hudimesnil,50,,,502520000C0561,,,,,,,,,,,,,0,,,,,S,sols,,,462,-1.493367,48.85945
2019-759543,2019-12-20,000001,Vente,137100,,,LES TERRES ALIX,C436,50510,50252,Hudimesnil,50,,,502520000C0564,,,,,,,,,,,,,0,,,,,J,jardins,,,42,-1.493342,48.8593
