id_mutation,date_mutation,numero_disposition,nature_mutation,valeur_fonciere,adresse_numero,adresse_suffixe,adresse_nom_voie,adresse_code_voie,code_postal,code_commune,nom_commune,code_departement,ancien_code_commune,ancien_nom_commune,id_parcelle,ancien_id_parcelle,numero_volume,lot1_numero,lot1_surface_carrez,lot2_numero,lot2_surface_carrez,lot3_numero,lot3_surface_carrez,lot4_numero,lot4_surface_carrez,lot5_numero,lot5_surface_carrez,nombre_lots,code_type_local,type_local,surface_reelle_bati,nombre_pieces_principales,code_nature_culture,nature_culture,code_nature_culture_speciale,nature_culture_speciale,surface_terrain,longitude,latitude
2019-750369,2019-02-25,000001,Vente,15000,,,LA MAISON NEUVE,B070,50600,50274,Les Loges-Marchis,50,,,50274000ZC0204,,,,,,,,,,,,,0,,,,,AB,terrains a bâtir,,,1000,-1.091109,48.55008
2019-750369,2019-02-25,000001,Vente,15000,,,LA MAISON NEUVE,B070,50600,50274,Les Loges-Marchis,50,,,50274000ZC0205,,,,,,,,,,,,,0,,,,,AB,terrains a bâtir,,,120,-1.091351,48.550372
2019-750477,2019-02-22,000001,Vente,49385,5329,,HUCHERIE,B061,50600,50274,Les Loges-Marchis,50,,,50274000YB0163,,,,,,,,,,,,,0,1,Maison,73,4,S,sols,,,103,-1.108715,48.553163
2019-750477,2019-02-22,000001,Vente,49385,,,HUCHERIE,B061,50600,50274,Les Loges-Marchis,50,,,50274000YB0167,,,,,,,,,,,,,0,,,,,P,prés,,,8405,-1.109641,48.553095
2019-750477,2019-02-22,000001,Vente,49385,,,HUCHERIE,B061,50600,50274,Les Loges-Marchis,50,,,50274000YB0167,,,,,,,,,,,,,0,,,,,BT,taillis simples,,,4480,-1.109641,48.553095
2019-750477,2019-02-22,000001,Vente,49385,,,HUCHERIE,B061,50600,50274,Les Loges-Marchis,50,,,50274000YB0167,,,,,,,,,,,,,0,,,,,S,sols,,,500,-1.109641,48.553095
2019-750532,2019-03-20,000002,Echange,13576,,,LE CERISIER,B026,50600,50274,Les Loges-Marchis,50,,,50274000ZA0072,,,,,,,,,,,,,0,,,,,T,terres,,,10480,-1.094696,48.5572
2019-750573,2019-03-20,000001,Vente,23876,,,LE CLOS NEUF,B036,50600,50274,Les Loges-Marchis,50,,,50274000YB0030,,,,,,,,,,,,,0,,,,,P,prés,,,10660,-1.094967,48.555007
2019-750573,2019-03-20,000001,Vente,23876,,,LE CLOS NEUF,B036,50600,50274,Les Loges-Marchis,50,,,50274000YB0030,,,,,,,,,,,,,0,,,,,T,terres,,,7770,-1.094967,48.555007
2019-750817,2019-04-15,000001,Vente,6000,,,LE DOMAINE,B044,50600,50274,Les Loges-Marchis,50,,,50274000YB0108,,,,,,,,,,,,,0,,,,,P,prés,,,3080,-1.104961,48.552824
2019-751557,2019-06-19,000001,Vente,21000,,,LA ROUGERIE,B094,50600,50274,Les Loges-Marchis,50,,,50274000ZX0038,,,,,,,,,,,,,0,,,,,P,prés,,,8230,-1.098961,48.535339
2019-751557,2019-06-19,000001,Vente,21000,,,LA ROUGERIE,B094,50600,50274,Les Loges-Marchis,50,,,50274000ZX0039,,,,,,,,,,,,,0,,,,,P,prés,,,12980,-1.09843,48.534894
2019-751564,2019-06-24,000001,Vente,10000,45,,LA GROSSETIERE,B050,50600,50274,Les Loges-Marchis,50,,,50274000ZC0058,,,,,,,,,,,,,0,1,Maison,35,1,VE,vergers,,,710,-1.078792,48.548416
2019-751564,2019-06-24,000001,Vente,10000,45,,LA GROSSETIERE,B050,50600,50274,Les Loges-Marchis,50,,,50274000ZC0058,,,,,,,,,,,,,0,1,Maison,35,1,S,sols,,,500,-1.078792,48.548416
2019-751945,2019-07-23,000001,Vente,4000,,,HUCHERIE,B061,50600,50274,Les Loges-Marchis,50,,,50274000YB0142,,,,,,,,,,,,,0,,,,,BT,taillis simples,,,3920,-1.109702,48.552422
2019-752048,2019-07-17,000001,Vente,17312,,,LE BOIS MOISSY,B010,50600,50274,Les Loges-Marchis,50,,,50274000ZC0173,,,,,,,,,,,,,0,,,,,AB,terrains a bâtir,,,1082,-1.090327,48.544687
2019-752088,2019-07-30,000001,Vente,195000,131,,LA MORINAIS,B077,50600,50274,Les Loges-Marchis,50,,,50274000ZP0051,,,,,,,,,,,,,0,1,Maison,190,5,T,terres,,,3063,-1.069637,48.513313
2019-752088,2019-07-30,000001,Vente,195000,131,,LA MORINAIS,B077,50600,50274,Les Loges-Marchis,50,,,50274000ZP0051,,,,,,,,,,,,,0,1,Maison,190,5,S,sols,,,1000,-1.069637,48.513313
2019-752088,2019-07-30,000001,Vente,195000,,,LA MORINAIS,B077,50600,50274,Les Loges-Marchis,50,,,50274000ZP0052,,,,,,,,,,,,,0,,,,,T,terres,,,444,-1.069695,48.512834
2019-752398,2019-08-29,000001,Vente,5000,,,BELLEVUE,B006,50600,50274,Les Loges-Marchis,50,,,50274000ZS0055,,,,,,,,,,,,,0,,,,,T,terres,,,5520,-1.095247,48.514652
2019-752734,2019-09-19,000001,Vente,70500,105,,PINCE,B084,50600,50274,Les Loges-Marchis,50,,,50274000ZH0014,,,,,,,,,,,,,0,1,Maison,58,2,VE,vergers,,,4880,-1.053927,48.535204
2019-752734,2019-09-19,000001,Vente,70500,105,,PINCE,B084,50600,50274,Les Loges-Marchis,50,,,50274000ZH0014,,,,,,,,,,,,,0,1,Maison,58,2,S,sols,,,1000,-1.053927,48.535204
2019-752735,2019-09-18,000001,Vente,400,,,LE CLOS NEUF,B036,50600,50274,Les Loges-Marchis,50,,,50274000YB0024,,,,,,,,,,,,,0,,,,,P,prés,,,1980,-1.096684,48.555688
2019-753032,2019-10-15,000001,Vente,4500,,,LA SAUVAGERE,B099,50600,50274,Les Loges-Marchis,50,,,50274000ZK0027,,,,,,,,,,,,,0,,,,,VE,vergers,,,780,-1.08196,48.531291
2019-753032,2019-10-15,000001,Vente,4500,,,LA SAUVAGERE,B099,50600,50274,Les Loges-Marchis,50,,,50274000ZK0077,,,,,,,,,,,,,0,,,,,T,terres,,,2010,-1.082326,48.531248
2019-753035,2019-10-18,000001,Vente,100000,357,,LA HANTRAYE,B054,50600,50274,Les Loges-Marchis,50,,,50274000YA0028,,,,,,,,,,,,,0,4,Local industriel. commercial ou assimilé,,,S,sols,,,3160,-1.093228,48.548091
2019-753035,2019-10-18,000001,Vente,100000,357,,LA HANTRAYE,B054,50600,50274,Les Loges-Marchis,50,,,50274000YA0028,,,,,,,,,,,,,0,1,Maison,85,5,S,sols,,,3160,-1.093228,48.548091
2019-753411,2019-11-14,000001,Vente,60000,,,LE MOQUE SOURIS,B076,50600,50274,Les Loges-Marchis,50,,,50274000ZV0003,,,,,,,,,,,,,0,,,,,L,landes,,,2670,-1.114494,48.524043
2019-753411,2019-11-14,000001,Vente,60000,,,LE MOQUE SOURIS,B076,50600,50274,Les Loges-Marchis,50,,,50274000ZV0006,,,,,,,,,,,,,0,,,,,L,landes,,,3050,-1.113427,48.523075
2019-753411,2019-11-14,000001,Vente,60000,,,LA BOUDERIE DE HAUT,B015,50600,50274,Les Loges-Marchis,50,,,50274000ZV0007,,,,,,,,,,,,,0,,,,,T,terres,,,18720,-1.112163,48.521766
2019-753411,2019-11-14,000001,Vente,60000,247,,LA BOUDERIE DE HAUT,B015,50600,50274,Les Loges-Marchis,50,,,50274000ZV0017,,,,,,,,,,,,,0,1,Maison,48,2,S,sols,,,1500,-1.109899,48.520216
2019-753411,2019-11-14,000001,Vente,60000,247,,LA BOUDERIE DE HAUT,B015,50600,50274,Les Loges-Marchis,50,,,50274000ZV0017,,,,,,,,,,,,,0,1,Maison,48,2,P,prés,,,10590,-1.109899,48.520216
2019-753411,2019-11-14,000001,Vente,60000,,,LA BOUDERIE DE HAUT,B015,50600,50274,Les Loges-Marchis,50,,,50274000ZV0018,,,,,,,,,,,,,0,,,,,P,prés,,,620,-1.108564,48.519811
2019-753411,2019-11-14,000001,Vente,60000,,,LE CHALENGE,B028,50600,50274,Les Loges-Marchis,50,,,50274000ZW0033,,,,,,,,,,,,,0,,,,,P,prés,,,8460,-1.11632,48.530307
2019-753411,2019-11-14,000001,Vente,60000,,,LE CHALENGE,B028,50600,50274,Les Loges-Marchis,50,,,50274000ZW0033,,,,,,,,,,,,,0,,,,,P,prés,,,1000,-1.11632,48.530307
2019-753453,2019-11-18,000002,Vente,120000,,,LA ROUGERIE,B094,50600,50274,Les Loges-Marchis,50,,,50274000ZW0060,,,,,,,,,,,,,0,,,,,P,prés,,,10386,-1.104119,48.531476
2019-753453,2019-11-18,000002,Vente,120000,,,LE MEZERAI,B074,50600,50274,Les Loges-Marchis,50,,,50274000ZY0062,,,,,,,,,,,,,0,,,,,T,terres,,,16820,-1.102395,48.532893
2019-753453,2019-11-18,000002,Vente,120000,,,LE MEZERAI,B074,50600,50274,Les Loges-Marchis,50,,,50274000ZY0064,,,,,,,,,,,,,0,,,,,T,terres,,,19690,-1.103776,48.532691
2019-753453,2019-11-18,000002,Vente,120000,,,LE MEZERAI,B074,50600,50274,Les Loges-Marchis,50,,,50274000ZY0064,,,,,,,,,,,,,0,,,,,T,terres,,,6000,-1.103776,48.532691
2019-753457,2019-11-27,000001,Vente,95000,,,LE MOQUE SOURIS,B076,50600,50274,Les Loges-Marchis,50,,,50274000ZV0001,,,,,,,,,,,,,0,,,,,P,prés,,,4320,-1.115549,48.52443
2019-753457,2019-11-27,000001,Vente,95000,,,LE MEZERAI,B074,50600,50274,Les Loges-Marchis,50,,,50274000ZY0065,,,,,,,,,,,,,0,,,,,P,prés,,,6350,-1.10394,48.533549
2019-753741,2019-12-11,000001,Vente,150000,246,,LA BOUDERIE DE HAUT,B015,50600,50274,Les Loges-Marchis,50,,,50274000ZV0014,,,,,,,,,,,,,0,1,Maison,100,5,P,prés,,,1600,-1.11161,48.519841
2019-753741,2019-12-11,000001,Vente,150000,246,,LA BOUDERIE DE HAUT,B015,50600,50274,Les Loges-Marchis,50,,,50274000ZV0014,,,,,,,,,,,,,0,1,Maison,100,5,T,terres,,,20340,-1.11161,48.519841
2019-753741,2019-12-11,000001,Vente,150000,246,,LA BOUDERIE DE HAUT,B015,50600,50274,Les Loges-Marchis,50,,,50274000ZV0014,,,,,,,,,,,,,0,1,Maison,100,5,S,sols,,,8000,-1.11161,48.519841
2019-753742,2019-12-11,000002,Vente,154000,,,LESNERAIE,B066,50600,50274,Les Loges-Marchis,50,,,50274000ZV0052,,,,,,,,,,,,,0,,,,,P,prés,,,4800,-1.114319,48.518619
2019-753742,2019-12-11,000002,Vente,154000,,,LESNERAIE,B066,50600,50274,Les Loges-Marchis,50,,,50274000ZV0053,,,,,,,,,,,,,0,,,,,P,prés,,,5190,-1.11505,48.519002
2019-753743,2019-12-11,000003,Vente,98000,246,,LA BOUDERIE DE HAUT,B015,50600,50274,Les Loges-Marchis,50,,,50274000ZV0014,,,,,,,,,,,,,0,1,Maison,100,5,S,sols,,,8000,-1.11161,48.519841
2019-753743,2019-12-11,000003,Vente,98000,246,,LA BOUDERIE DE HAUT,B015,50600,50274,Les Loges-Marchis,50,,,50274000ZV0014,,,,,,,,,,,,,0,1,Maison,100,5,P,prés,,,1600,-1.11161,48.519841
2019-753743,2019-12-11,000003,Vente,98000,246,,LA BOUDERIE DE HAUT,B015,50600,50274,Les Loges-Marchis,50,,,50274000ZV0014,,,,,,,,,,,,,0,1,Maison,100,5,T,terres,,,20340,-1.11161,48.519841
2019-753743,2019-12-11,000003,Vente,98000,,,LE HALLIER,B052,50600,50274,Les Loges-Marchis,50,,,50274000ZV0044,,,,,,,,,,,,,0,,,,,P,prés,,,21560,-1.10959,48.517439
2019-753743,2019-12-11,000003,Vente,98000,,,LE HALLIER,B052,50600,50274,Les Loges-Marchis,50,,,50274000ZV0047,,,,,,,,,,,,,0,,,,,P,prés,,,22010,-1.112405,48.517773
2019-753743,2019-12-11,000003,Vente,98000,,,LE HALLIER,B052,50600,50274,Les Loges-Marchis,50,,,50274000ZV0065,,,,,,,,,,,,,0,,,,,P,prés,,,260,-1.110649,48.519113
2019-753743,2019-12-11,000003,Vente,98000,,,LE HALLIER,B052,50600,50274,Les Loges-Marchis,50,,,50274000ZV0067,,,,,,,,,,,,,0,,,,,P,prés,,,1150,-1.112319,48.518691
2019-753743,2019-12-11,000003,Vente,98000,,,LE HALLIER,B052,50600,50274,Les Loges-Marchis,50,,,50274000ZV0069,,,,,,,,,,,,,0,,,,,P,prés,,,400,-1.113438,48.518389
2019-753766,2019-12-11,000001,Vente,52000,,,LA BOUDERIE DE HAUT,B015,50600,50274,Les Loges-Marchis,50,,,50274000ZV0009,,,,,,,,,,,,,0,,,,,S,sols,,,80,-1.111296,48.520989
2019-753766,2019-12-11,000001,Vente,52000,,,LE MOQUE SOURIS,B076,50600,50274,Les Loges-Marchis,50,,,50274000ZV0056,,,,,,,,,,,,,0,,,,,T,terres,,,4750,-1.114397,48.522959
2019-753766,2019-12-11,000001,Vente,52000,,,LE MOQUE SOURIS,B076,50600,50274,Les Loges-Marchis,50,,,50274000ZV0056,,,,,,,,,,,,,0,,,,,P,prés,,,34520,-1.114397,48.522959
2019-753766,2019-12-11,000001,Vente,52000,,,LE MOQUE SOURIS,B076,50600,50274,Les Loges-Marchis,50,,,50274000ZV0056,,,,,,,,,,,,,0,,,,,L,landes,,,2115,-1.114397,48.522959
2019-753771,2019-12-13,000002,Vente,171.84,,,LA GROSSETIERE,B050,50600,50274,Les Loges-Marchis,50,,,50274000ZC0201,,,,,,,,,,,,,0,,,,,T,terres,,,238,,
2019-753981,2019-12-16,000002,Vente,119.54,,,LA GROSSETIERE,B050,50600,50274,Les Loges-Marchis,50,,,50274000ZC0199,,,,,,,,,,,,,0,,,,,P,prés,,,170,,
