id_mutation,date_mutation,numero_disposition,nature_mutation,valeur_fonciere,adresse_numero,adresse_suffixe,adresse_nom_voie,adresse_code_voie,code_postal,code_commune,nom_commune,code_departement,ancien_code_commune,ancien_nom_commune,id_parcelle,ancien_id_parcelle,numero_volume,lot1_numero,lot1_surface_carrez,lot2_numero,lot2_surface_carrez,lot3_numero,lot3_surface_carrez,lot4_numero,lot4_surface_carrez,lot5_numero,lot5_surface_carrez,nombre_lots,code_type_local,type_local,surface_reelle_bati,nombre_pieces_principales,code_nature_culture,nature_culture,code_nature_culture_speciale,nature_culture_speciale,surface_terrain,longitude,latitude
2019-750173,2019-02-07,000001,Vente,160000,1,,LES GENETS,C082,50530,50276,Lolif,50,,,50276000ZK0117,,,,,,,,,,,,,0,1,Maison,112,4,,,,,,-1.423718,48.726285
2019-751349,2019-05-25,000001,Vente,3300,,,BELINS,C028,50530,50276,Lolif,50,,,50276000ZL0061,,,,,,,,,,,,,0,,,,,P,prés,,,9340,-1.399415,48.718236
2019-751350,2019-05-25,000001,Vente,4000,,,LE BOULIN GIRON,C030,50530,50276,Lolif,50,,,50276000ZC0084,,,,,,,,,,,,,0,,,,,P,prés,,,6090,-1.390298,48.735603
2019-751351,2019-05-25,000001,Vente,16926,,,BEAU LIEU,B819,50530,50276,Lolif,50,,,50276000ZC0087,,,,,,,,,,,,,0,,,,,P,prés,,,9500,-1.392479,48.735627
2019-751351,2019-05-25,000001,Vente,16926,,,LA MANHEUDIERE,C116,50530,50276,Lolif,50,,,50276000ZL0007,,,,,,,,,,,,,0,,,,,P,prés,,,14680,-1.394872,48.726614
2019-751352,2019-05-25,000001,Vente,168000,,,LA CORNICHE,B840,50530,50276,Lolif,50,,,50276000ZC0099,,,,,,,,,,,,,0,,,,,T,terres,,,5370,-1.394375,48.734428
2019-751352,2019-05-25,000001,Vente,168000,,,LA CORNICHE,B840,50530,50276,Lolif,50,,,50276000ZC0099,,,,,,,,,,,,,0,,,,,S,sols,,,500,-1.394375,48.734428
2019-751352,2019-05-25,000001,Vente,168000,,,LE BOURG DE LOLIF,C034,50530,50276,Lolif,50,,,50276000ZH0156,,,,,,,,,,,,,0,,,,,P,prés,,,32348,-1.390904,48.734739
2019-751476,2019-05-29,000001,Vente,32913,,,LE JARDIN MARTIN,C102,50530,50276,Lolif,50,,,50276000ZH0114,,,,,,,,,,,,,0,,,,,T,terres,,,36570,-1.392959,48.730389
2019-751479,2019-06-18,000001,Vente,133000,5,,LES CORVEES,B843,50530,50276,Lolif,50,,,50276000ZC0140,,,,,,,,,,,,,0,1,Maison,85,4,S,sols,,,776,-1.394663,48.735828
2019-751539,2019-05-28,000001,Vente,54000,3,,LES VIGNES,C178,50530,50276,Lolif,50,,,50276000ZD0082,,,,,,,,,,,,,0,1,Maison,100,3,VE,vergers,,,7618,-1.368724,48.735084
2019-751539,2019-05-28,000001,Vente,54000,3,,LES VIGNES,C178,50530,50276,Lolif,50,,,50276000ZD0082,,,,,,,,,,,,,0,1,Maison,100,3,S,sols,,,1000,-1.368724,48.735084
2019-751539,2019-05-28,000001,Vente,54000,3,,LES VIGNES,C178,50530,50276,Lolif,50,,,50276000ZD0082,,,,,,,,,,,,,0,1,Maison,100,3,T,terres,,,5557,-1.368724,48.735084
2019-751750,2019-06-21,000001,Vente,31900,,,RUE DE VIREMONT,0060,50530,50276,Lolif,50,,,50276000ZE0131,,,,,,,,,,,,,0,,,,,S,sols,,,500,-1.419237,48.737802
2019-751750,2019-06-21,000001,Vente,31900,,,RUE DE VIREMONT,0060,50530,50276,Lolif,50,,,50276000ZE0131,,,,,,,,,,,,,0,,,,,P,prés,,,636,-1.419237,48.737802
2019-751765,2019-07-06,000001,Vente,257000,,,LARSONNIERE,C110,50530,50276,Lolif,50,,,50276000ZN0064,,,,,,,,,,,,,0,,,,,S,sols,,,225,-1.413011,48.716213
2019-751917,2019-06-29,000001,Vente,,,,LE BOURG DE MONTVIRON,C036,50530,50276,Lolif,50,,,50276000ZE0137,,,,,,,,,,,,,0,,,,,AB,terrains a bâtir,,,164,-1.419103,48.737207
2019-752014,2019-07-06,000001,Vente,1,,,LE BOURG DE MONTVIRON,C036,50530,50276,Lolif,50,,,50276000ZE0152,,,,,,,,,,,,,0,,,,,S,sols,,,103,-1.418824,48.73718
2019-752274,2019-08-21,000001,Vente,155000,,,LES FAVERIES,C068,50530,50276,Lolif,50,,,50276000ZI0054,,,,,,,,,,,,,0,3,Dépendance,,0,S,sols,,,409,-1.375782,48.72985
2019-752274,2019-08-21,000001,Vente,155000,3,,LES FAVERIES,C068,50530,50276,Lolif,50,,,50276000ZI0070,,,,,,,,,,,,,0,1,Maison,50,0,S,sols,,,767,-1.375879,48.730052
2019-752516,2019-08-30,000001,Vente,8000,,,LA BOULAYE,C032,50530,50276,Lolif,50,,,50276000ZD0018,,,,,,,,,,,,,0,,,,,BT,taillis simples,,,18370,-1.374454,48.737918
2019-752523,2019-08-29,000001,Vente,36326,,,L EPINETTE,C066,50530,50276,Lolif,50,,,50276000ZM0073,,,,,,,,,,,,,0,,,,,P,prés,,,27796,-1.38232,48.724878
2019-752902,2019-09-27,000001,Vente,45000,3,,LA BUTTE ES GROS,C044,50530,50276,Lolif,50,,,50276000ZE0058,,,,,,,,,,,,,0,1,Maison,48,1,J,jardins,,,540,-1.424132,48.729829
2019-752902,2019-09-27,000001,Vente,45000,3,,LA BUTTE ES GROS,C044,50530,50276,Lolif,50,,,50276000ZE0058,,,,,,,,,,,,,0,1,Maison,48,1,S,sols,,,350,-1.424132,48.729829
2019-753064,2019-10-08,000001,Vente,145000,17,,LA BUTTE ES GROS,C044,50530,50276,Lolif,50,,,50276000ZK0109,,,,,,,,,,,,,0,1,Maison,130,5,S,sols,,,500,-1.424372,48.728411
2019-753064,2019-10-08,000001,Vente,145000,17,,LA BUTTE ES GROS,C044,50530,50276,Lolif,50,,,50276000ZK0109,,,,,,,,,,,,,0,1,Maison,130,5,AG,terrains d'agrément,,,1367,-1.424372,48.728411
2019-753148,2019-11-04,000001,Vente,180000,,,MARTIGNY,C120,50530,50276,Lolif,50,,,50276000ZC0034,,,,,,,,,,,,,0,,,,,S,sols,,,150,-1.381698,48.743989
2019-753148,2019-11-04,000001,Vente,180000,9,,MARTIGNY,C120,50530,50276,Lolif,50,,,50276000ZC0035,,,,,,,,,,,,,0,1,Maison,150,6,J,jardins,,,1310,-1.381367,48.744052
2019-753148,2019-11-04,000001,Vente,180000,9,,MARTIGNY,C120,50530,50276,Lolif,50,,,50276000ZC0035,,,,,,,,,,,,,0,1,Maison,150,6,S,sols,,,1000,-1.381367,48.744052
2019-753310,2019-11-09,000001,Vente,20000,,,LE BOURG DE LOLIF,C034,50530,50276,Lolif,50,,,50276000ZH0145,,,,,,,,,,,,,0,,,,,P,prés,,,714,-1.390979,48.733274
2019-753310,2019-11-09,000001,Vente,20000,,,LE BOURG DE LOLIF,C034,50530,50276,Lolif,50,,,50276000ZH0149,,,,,,,,,,,,,0,,,,,J,jardins,,,3,-1.390913,48.73311
2019-753310,2019-11-09,000001,Vente,20000,,,LE BOURG DE LOLIF,C034,50530,50276,Lolif,50,,,50276000ZH0150,,,,,,,,,,,,,0,,,,,J,jardins,,,48,-1.390884,48.733165
2019-753383,2019-11-26,000001,Echange,20287,,,LE HAUT BRAIZE,C093,50530,50276,Lolif,50,,,50276000ZD0067,,,,,,,,,,,,,0,,,,,T,terres,,,12100,-1.377978,48.731184
2019-753384,2019-11-26,000002,Echange,37190,,,LE JARDIN MARTIN,C102,50530,50276,Lolif,50,,,50276000ZH0114,,,,,,,,,,,,,0,,,,,T,terres,,,36570,-1.392959,48.730389
2019-753574,2019-11-21,000001,Vente,100000,2,,BEAU LIEU,B819,50530,50276,Lolif,50,,,50276000ZC0097,,,,,,,,,,,,,0,1,Maison,65,4,S,sols,,,970,-1.393953,48.735228
2019-753574,2019-11-21,000001,Vente,100000,,,BEAU LIEU,B819,50530,50276,Lolif,50,,,50276000ZC0131,,,,,,,,,,,,,0,,,,,P,prés,,,412,-1.393959,48.735395
2019-753587,2019-11-26,000001,Vente,203500,4,,LE MIDI,B853,50530,50276,Lolif,50,,,50276000ZH0103,,,,,,,,,,,,,0,1,Maison,163,6,S,sols,,,500,-1.390131,48.731343
2019-753587,2019-11-26,000001,Vente,203500,4,,LE MIDI,B853,50530,50276,Lolif,50,,,50276000ZH0103,,,,,,,,,,,,,0,1,Maison,163,6,AG,terrains d'agrément,,,924,-1.390131,48.731343
2019-753714,2019-11-29,000001,Vente,100000,2,,COULONCE,C056,50530,50276,Lolif,50,,,50276000ZN0045,,,,,,,,,,,,,0,1,Maison,64,3,J,jardins,,,1740,-1.403281,48.712863
2019-753714,2019-11-29,000001,Vente,100000,2,,COULONCE,C056,50530,50276,Lolif,50,,,50276000ZN0045,,,,,,,,,,,,,0,1,Maison,64,3,S,sols,,,1000,-1.403281,48.712863
2019-753930,2019-12-26,000001,Vente,1800,,,LONGRAYE,C112,50530,50276,Lolif,50,,,50276000ZE0042,,,,,,,,,,,,,0,,,,,P,prés,,,3550,-1.412774,48.731283
