id_mutation,date_mutation,numero_disposition,nature_mutation,valeur_fonciere,adresse_numero,adresse_suffixe,adresse_nom_voie,adresse_code_voie,code_postal,code_commune,nom_commune,code_departement,ancien_code_commune,ancien_nom_commune,id_parcelle,ancien_id_parcelle,numero_volume,lot1_numero,lot1_surface_carrez,lot2_numero,lot2_surface_carrez,lot3_numero,lot3_surface_carrez,lot4_numero,lot4_surface_carrez,lot5_numero,lot5_surface_carrez,nombre_lots,code_type_local,type_local,surface_reelle_bati,nombre_pieces_principales,code_nature_culture,nature_culture,code_nature_culture_speciale,nature_culture_speciale,surface_terrain,longitude,latitude
2019-759624,2019-01-23,000001,Vente,5000,,,LA VENTE A GENETS,B666,50390,50486,Saint-Jacques-de-Néhou,50,,,504860000E0426,,,,,,,,,,,,,0,,,,,P,prés,,,8890,-1.601309,49.433075
2019-759764,2019-02-26,000001,Vente,90000,,,LA BRECHE AUX CHARRIERES,B042,50390,50486,Saint-Jacques-de-Néhou,50,,,504860000D0672,,,,,,,,,,,,,0,,,,,P,prés,,,3060,-1.636784,49.421632
2019-759764,2019-02-26,000001,Vente,90000,,,LA BRECHE AUX CHARRIERES,B042,50390,50486,Saint-Jacques-de-Néhou,50,,,504860000D0673,,,,,,,,,,,,,0,,,,,P,prés,,,1837,-1.636452,49.421725
2019-759764,2019-02-26,000001,Vente,90000,,,LA BRECHE AUX CHARRIERES,B042,50390,50486,Saint-Jacques-de-Néhou,50,,,504860000D0675,,,,,,,,,,,,,0,,,,,J,jardins,,,507,-1.637272,49.422097
2019-759764,2019-02-26,000001,Vente,90000,1,,RTE DE GONNEVILLE,0060,50390,50486,Saint-Jacques-de-Néhou,50,,,504860000D0825,,,,,,,,,,,,,0,1,Maison,57,2,S,sols,,,564,-1.636982,49.422136
2019-759764,2019-02-26,000001,Vente,90000,,,LA BRECHE AUX CHARRIERES,B042,50390,50486,Saint-Jacques-de-Néhou,50,,,504860000D0826,,,,,,,,,,,,,0,,,,,P,prés,,,30,-1.636553,49.42194
2019-759776,2019-03-02,000001,Vente,2000,,,LE CLOS PICOT,B216,50390,50486,Saint-Jacques-de-Néhou,50,,,504860000D0693,,,,,,,,,,,,,0,,,,,P,prés,,,3040,-1.640711,49.423333
2019-759824,2019-03-11,000001,Vente,110000,,,LE CLOS D AVAL,B105,50390,50486,Saint-Jacques-de-Néhou,50,,,504860000B0178,,,,,,,,,,,,,0,,,,,P,prés,,,3043,-1.588118,49.415919
2019-759824,2019-03-11,000001,Vente,110000,,,LA BARRIERE DU LUDE,B010,50390,50486,Saint-Jacques-de-Néhou,50,,,504860000B0185,,,,,,,,,,,,,0,,,,,S,sols,,,11,-1.589409,49.415642
2019-759824,2019-03-11,000001,Vente,110000,,,LA BARRIERE DU LUDE,B010,50390,50486,Saint-Jacques-de-Néhou,50,,,504860000B0185,,,,,,,,,,,,,0,,,,,J,jardins,,,818,-1.589409,49.415642
2019-759824,2019-03-11,000001,Vente,110000,,,LA BARRIERE DU LUDE,B010,50390,50486,Saint-Jacques-de-Néhou,50,,,504860000B0186,,,,,,,,,,,,,0,,,,,J,jardins,,,340,-1.589098,49.41572
2019-759824,2019-03-11,000001,Vente,110000,,,LA BARRIERE DU LUDE,B010,50390,50486,Saint-Jacques-de-Néhou,50,,,504860000B0188,,,,,,,,,,,,,0,,,,,J,jardins,,,507,-1.589301,49.415917
2019-759824,2019-03-11,000001,Vente,110000,,,LA BARRIERE DU LUDE,B010,50390,50486,Saint-Jacques-de-Néhou,50,,,504860000B0188,,,,,,,,,,,,,0,,,,,S,sols,,,130,-1.589301,49.415917
2019-759824,2019-03-11,000001,Vente,110000,,,LA BARRIERE DU LUDE,B010,50390,50486,Saint-Jacques-de-Néhou,50,,,504860000B0891,,,,,,,,,,,,,0,,,,,S,sols,,,31,-1.589966,49.415506
2019-759824,2019-03-11,000001,Vente,110000,,,LA BARRIERE DU LUDE,B010,50390,50486,Saint-Jacques-de-Néhou,50,,,504860000B0901,,,,,,,,,,,,,0,,,,,P,prés,,,2069,-1.590145,49.41565
2019-759824,2019-03-11,000001,Vente,110000,,,LA BARRIERE DU LUDE,B010,50390,50486,Saint-Jacques-de-Néhou,50,,,504860000B0901,,,,,,,,,,,,,0,,,,,S,sols,,,63,-1.590145,49.41565
2019-759824,2019-03-11,000001,Vente,110000,23,,RTE DU LUDE,0130,50390,50486,Saint-Jacques-de-Néhou,50,,,504860000B0903,,,,,,,,,,,,,0,1,Maison,64,3,S,sols,,,254,-1.589707,49.415689
2019-759824,2019-03-11,000002,Vente,110000,,,LE CLOS D AVAL,B105,50390,50486,Saint-Jacques-de-Néhou,50,,,504860000B0178,,,,,,,,,,,,,0,,,,,P,prés,,,3043,-1.588118,49.415919
2019-759824,2019-03-11,000002,Vente,110000,,,LA BARRIERE DU LUDE,B010,50390,50486,Saint-Jacques-de-Néhou,50,,,504860000B0185,,,,,,,,,,,,,0,,,,,S,sols,,,11,-1.589409,49.415642
2019-759824,2019-03-11,000002,Vente,110000,,,LA BARRIERE DU LUDE,B010,50390,50486,Saint-Jacques-de-Néhou,50,,,504860000B0185,,,,,,,,,,,,,0,,,,,J,jardins,,,818,-1.589409,49.415642
2019-759824,2019-03-11,000002,Vente,110000,,,LA BARRIERE DU LUDE,B010,50390,50486,Saint-Jacques-de-Néhou,50,,,504860000B0186,,,,,,,,,,,,,0,,,,,J,jardins,,,340,-1.589098,49.41572
2019-759824,2019-03-11,000002,Vente,110000,,,LA BARRIERE DU LUDE,B010,50390,50486,Saint-Jacques-de-Néhou,50,,,504860000B0188,,,,,,,,,,,,,0,,,,,J,jardins,,,507,-1.589301,49.415917
2019-759824,2019-03-11,000002,Vente,110000,,,LA BARRIERE DU LUDE,B010,50390,50486,Saint-Jacques-de-Néhou,50,,,504860000B0188,,,,,,,,,,,,,0,,,,,S,sols,,,130,-1.589301,49.415917
2019-759824,2019-03-11,000002,Vente,110000,,,LA BARRIERE DU LUDE,B010,50390,50486,Saint-Jacques-de-Néhou,50,,,504860000B0891,,,,,,,,,,,,,0,,,,,S,sols,,,31,-1.589966,49.415506
2019-759824,2019-03-11,000002,Vente,110000,,,LA BARRIERE DU LUDE,B010,50390,50486,Saint-Jacques-de-Néhou,50,,,504860000B0901,,,,,,,,,,,,,0,,,,,S,sols,,,63,-1.590145,49.41565
2019-759824,2019-03-11,000002,Vente,110000,,,LA BARRIERE DU LUDE,B010,50390,50486,Saint-Jacques-de-Néhou,50,,,504860000B0901,,,,,,,,,,,,,0,,,,,P,prés,,,2069,-1.590145,49.41565
2019-759824,2019-03-11,000002,Vente,110000,23,,RTE DU LUDE,0130,50390,50486,Saint-Jacques-de-Néhou,50,,,504860000B0903,,,,,,,,,,,,,0,1,Maison,64,3,S,sols,,,254,-1.589707,49.415689
2019-759993,2019-04-01,000001,Vente,117000,,,LA VENTE A GENETS,B666,50390,50486,Saint-Jacques-de-Néhou,50,,,504860000E0552,,,,,,,,,,,,,0,,,,,P,prés,,,3555,-1.600254,49.42674
2019-759993,2019-04-01,000001,Vente,117000,,,LA VENTE A GENETS,B666,50390,50486,Saint-Jacques-de-Néhou,50,,,504860000E0553,,,,,,,,,,,,,0,,,,,P,prés,,,3735,-1.599793,49.426781
2019-759993,2019-04-01,000001,Vente,117000,4,,RTE DU HAMEAU BREDONCHEL,0070,50390,50486,Saint-Jacques-de-Néhou,50,,,504860000E0557,,,,,,,,,,,,,0,1,Maison,74,3,J,jardins,,,435,-1.599999,49.426107
2019-759993,2019-04-01,000001,Vente,117000,4,,RTE DU HAMEAU BREDONCHEL,0070,50390,50486,Saint-Jacques-de-Néhou,50,,,504860000E0557,,,,,,,,,,,,,0,1,Maison,74,3,S,sols,,,300,-1.599999,49.426107
2019-759993,2019-04-01,000001,Vente,117000,,,LE HAMEAU BREDONCHEL,B342,50390,50486,Saint-Jacques-de-Néhou,50,,,504860000E0558,,,,,,,,,,,,,0,,,,,S,sols,,,200,-1.600189,49.425999
2019-759993,2019-04-01,000001,Vente,117000,,,LE HAMEAU BREDONCHEL,B342,50390,50486,Saint-Jacques-de-Néhou,50,,,504860000E0558,,,,,,,,,,,,,0,,,,,P,prés,,,1890,-1.600189,49.425999
2019-759993,2019-04-01,000001,Vente,117000,,,LE CLOS DE HAUT,B112,50390,50486,Saint-Jacques-de-Néhou,50,,,504860000E0564,,,,,,,,,,,,,0,,,,,P,prés,,,3000,-1.600066,49.425388
2019-760051,2019-04-19,000001,Vente,40000,,,VILLAGE DE L EGLISE,B682,50390,50486,Saint-Jacques-de-Néhou,50,,,504860000C1077,,,,,,,,,,,,,0,,,,,S,sols,,,17,-1.615821,49.417311
2019-760051,2019-04-19,000001,Vente,40000,,,VILLAGE DE L EGLISE,B682,50390,50486,Saint-Jacques-de-Néhou,50,,,504860000C1081,,,,,,,,,,,,,0,,,,,S,sols,,,10,-1.615863,49.417425
2019-760051,2019-04-19,000001,Vente,40000,51,,LE BOURG,B689,50390,50486,Saint-Jacques-de-Néhou,50,,,504860000C1082,,,,,,,,,,,,,0,1,Maison,80,4,S,sols,,,219,-1.615913,49.417478
2019-760051,2019-04-19,000001,Vente,40000,,,VILLAGE DE L EGLISE,B682,50390,50486,Saint-Jacques-de-Néhou,50,,,504860000C1089,,,,,,,,,,,,,0,,,,,S,sols,,,210,-1.615899,49.417321
2019-760094,2019-04-29,000001,Vente,74000,,,LA PETITE MERIELLERIE,B490,50390,50486,Saint-Jacques-de-Néhou,50,,,504860000D0128,,,,,,,,,,,,,0,,,,,S,sols,,,326,-1.633715,49.426
2019-760094,2019-04-29,000001,Vente,74000,,,LA PETITE MERIELLERIE,B490,50390,50486,Saint-Jacques-de-Néhou,50,,,504860000D0128,,,,,,,,,,,,,0,,,,,P,prés,,,4995,-1.633715,49.426
2019-760094,2019-04-29,000001,Vente,74000,,,LA PETITE MERIELLERIE,B490,50390,50486,Saint-Jacques-de-Néhou,50,,,504860000D0129,,,,,,,,,,,,,0,,,,,P,prés,,,334,-1.633449,49.425509
2019-760094,2019-04-29,000001,Vente,74000,,,LA PETITE MERIELLERIE,B490,50390,50486,Saint-Jacques-de-Néhou,50,,,504860000D0130,,,,,,,,,,,,,0,,,,,J,jardins,,,745,-1.633445,49.425327
2019-760094,2019-04-29,000001,Vente,74000,10,,RTE DE GONNEVILLE,0060,50390,50486,Saint-Jacques-de-Néhou,50,,,504860000D0131,,,,,,,,,,,,,0,1,Maison,61,4,S,sols,,,1230,-1.633896,49.425312
2019-760156,2019-05-18,000001,Vente,9000,,,LE CLOS CONTRE JACQUES FAU,B100,50390,50486,Saint-Jacques-de-Néhou,50,,,504860000B0627,,,,,,,,,,,,,0,,,,,P,prés,,,7580,-1.605508,49.400461
2019-760156,2019-05-18,000001,Vente,9000,,,LES FERMETURES SAINT JEAN,B279,50390,50486,Saint-Jacques-de-Néhou,50,,,504860000B0703,,,,,,,,,,,,,0,,,,,P,prés,,,8013,-1.606094,49.410839
2019-760379,2019-06-25,000001,Vente,131500,43,,RUE DE MONTROND,0140,50390,50486,Saint-Jacques-de-Néhou,50,,,504860000E0665,,,,,,,,,,,,,0,1,Maison,135,3,S,sols,,,258,-1.605655,49.420983
2019-760379,2019-06-25,000001,Vente,131500,,,GRANDE RUE DE MONTROND,B336,50390,50486,Saint-Jacques-de-Néhou,50,,,504860000E0666,,,,,,,,,,,,,0,,,,,S,sols,,,300,-1.605625,49.42076
2019-760379,2019-06-25,000001,Vente,131500,,,GRANDE RUE DE MONTROND,B336,50390,50486,Saint-Jacques-de-Néhou,50,,,504860000E0859,,,,,,,,,,,,,0,,,,,S,sols,,,323,-1.605809,49.420779
2019-760379,2019-06-25,000001,Vente,131500,,,GRANDE RUE DE MONTROND,B336,50390,50486,Saint-Jacques-de-Néhou,50,,,504860000E0862,,,,,,,,,,,,,0,,,,,J,jardins,,,106,-1.605756,49.421008
2019-760385,2019-06-27,000001,Vente,70000,,,LE CLOS A MOUCHES,B080,50390,50486,Saint-Jacques-de-Néhou,50,,,504860000B0695,,,,,,,,,,,,,0,,,,,S,sols,,,1071,-1.604185,49.40385
2019-760385,2019-06-27,000001,Vente,70000,,,LE CLOS A MOUCHES,B080,50390,50486,Saint-Jacques-de-Néhou,50,,,504860000B0695,,,,,,,,,,,,,0,,,,,P,prés,,,10479,-1.604185,49.40385
2019-760385,2019-06-27,000001,Vente,70000,9,,RUE DE DENNEVILLE,0050,50390,50486,Saint-Jacques-de-Néhou,50,,,504860000B0898,,,,,,,,,,,,,0,1,Maison,67,2,S,sols,,,448,-1.604719,49.404009
2019-760385,2019-06-27,000001,Vente,70000,,,SAINT JEAN DU BOIS,B634,50390,50486,Saint-Jacques-de-Néhou,50,,,504860000B0899,,,,,,,,,,,,,0,,,,,S,sols,,,40,-1.604584,49.404099
2019-760385,2019-06-27,000001,Vente,70000,,,SAINT JEAN DU BOIS,B634,50390,50486,Saint-Jacques-de-Néhou,50,,,504860000B0914,,,,,,,,,,,,,0,,,,,L,landes,,,253,-1.604995,49.403451
2019-760445,2019-07-05,000001,Vente,90000,4,,RTE DE GONNEVILLE,0060,50390,50486,Saint-Jacques-de-Néhou,50,,,504860000D0109,,,,,,,,,,,,,0,1,Maison,86,5,J,jardins,,,1065,-1.629663,49.426506
2019-760445,2019-07-05,000001,Vente,90000,4,,RTE DE GONNEVILLE,0060,50390,50486,Saint-Jacques-de-Néhou,50,,,504860000D0109,,,,,,,,,,,,,0,1,Maison,86,5,S,sols,,,930,-1.629663,49.426506
2019-760445,2019-07-05,000001,Vente,90000,,,LA MERIELLERIE,B431,50390,50486,Saint-Jacques-de-Néhou,50,,,504860000D0819,,,,,,,,,,,,,0,,,,,S,sols,,,1088,-1.629758,49.426846
2019-760445,2019-07-05,000001,Vente,90000,,,LA MERIELLERIE,B431,50390,50486,Saint-Jacques-de-Néhou,50,,,504860000D0820,,,,,,,,,,,,,0,,,,,S,sols,,,44,-1.629527,49.426542
2019-760784,2019-09-02,000002,Echange,2000,,,LE HAMEAU BREDONCHEL,B342,50390,50486,Saint-Jacques-de-Néhou,50,,,504860000E0892,,,,,,,,,,,,,0,,,,,P,prés,,,3075,-1.598202,49.426584
2019-760784,2019-09-02,000003,Echange,2000,,,LE CLOS DU FOSSE,B163,50390,50486,Saint-Jacques-de-Néhou,50,,,504860000E0352,,,,,,,,,,,,,0,,,,,P,prés,,,2477,-1.597097,49.427309
2019-760784,2019-09-02,000003,Echange,2000,,,LE CLOS RENE,B228,50390,50486,Saint-Jacques-de-Néhou,50,,,504860000E0890,,,,,,,,,,,,,0,,,,,P,prés,,,589,-1.597479,49.427046
2019-760794,2019-08-29,000001,Vente,26000,,,LA ROQUELLE,B625,50390,50486,Saint-Jacques-de-Néhou,50,,,504860000C0533,,,,,,,,,,,,,0,,,,,P,prés,,,1780,-1.623453,49.407119
2019-760794,2019-08-29,000001,Vente,26000,,,LA ROQUELLE,B625,50390,50486,Saint-Jacques-de-Néhou,50,,,504860000C0534,,,,,,,,,,,,,0,,,,,P,prés,,,7313,-1.622837,49.406947
2019-760794,2019-08-29,000001,Vente,26000,,,LA ROQUELLE,B625,50390,50486,Saint-Jacques-de-Néhou,50,,,504860000C0535,,,,,,,,,,,,,0,,,,,P,prés,,,1305,-1.622391,49.407258
2019-760794,2019-08-29,000001,Vente,26000,,,LA ROQUELLE,B625,50390,50486,Saint-Jacques-de-Néhou,50,,,504860000C0537,,,,,,,,,,,,,0,,,,,J,jardins,,,486,-1.623071,49.407413
2019-760794,2019-08-29,000001,Vente,26000,33,,RTE DE LA ROQUELLE,0160,50390,50486,Saint-Jacques-de-Néhou,50,,,504860000C0540,,,,,,,,,,,,,0,1,Maison,51,1,S,sols,,,797,-1.62259,49.40765
2019-760931,2019-10-01,000001,Vente,200,,,LA RAMEE,B624,50390,50486,Saint-Jacques-de-Néhou,50,,,504860000C1116,,,,,,,,,,,,,0,,,,,P,prés,,,1002,-1.627068,49.415234
2019-760983,2019-10-11,000001,Vente,160000,22,,RUE DE MONTROND,0140,50390,50486,Saint-Jacques-de-Néhou,50,,,504860000C1039,,,,,,,,,,,,,0,1,Maison,100,4,S,sols,,,500,-1.608086,49.419467
2019-760983,2019-10-11,000001,Vente,160000,22,,RUE DE MONTROND,0140,50390,50486,Saint-Jacques-de-Néhou,50,,,504860000C1039,,,,,,,,,,,,,0,1,Maison,100,4,J,jardins,,,973,-1.608086,49.419467
2019-761168,2019-11-18,000001,Vente,6000,,,LA LANDE ES VAUX,B412,50390,50486,Saint-Jacques-de-Néhou,50,,,504860000D0089,,,,,,,,,,,,,0,,,,,BT,taillis simples,,,1188,-1.625589,49.429908
2019-761168,2019-11-18,000001,Vente,6000,,,LA LANDE ES VAUX,B412,50390,50486,Saint-Jacques-de-Néhou,50,,,504860000D0090,,,,,,,,,,,,,0,,,,,P,prés,,,7516,-1.625439,49.42907
2019-761168,2019-11-18,000001,Vente,6000,,,LA LANDE ES VAUX,B412,50390,50486,Saint-Jacques-de-Néhou,50,,,504860000D0091,,,,,,,,,,,,,0,,,,,P,prés,,,10307,-1.626336,49.429408
2019-761171,2019-11-18,000001,Vente,45550,,,LA PETITE MERIELLERIE,B490,50390,50486,Saint-Jacques-de-Néhou,50,,,504860000D0124,,,,,,,,,,,,,0,,,,,P,prés,,,12650,-1.632714,49.425827
2019-761171,2019-11-18,000001,Vente,45550,,,LA LANDE ES VAUX,B412,50390,50486,Saint-Jacques-de-Néhou,50,,,504860000D0125,,,,,,,,,,,,,0,,,,,P,prés,,,8709,-1.632596,49.426822
2019-761171,2019-11-18,000001,Vente,45550,,,LA LANDE ES VAUX,B412,50390,50486,Saint-Jacques-de-Néhou,50,,,504860000D0126,,,,,,,,,,,,,0,,,,,P,prés,,,4892,-1.632608,49.427151
2019-761171,2019-11-18,000001,Vente,45550,,,LA LANDE ES VAUX,B412,50390,50486,Saint-Jacques-de-Néhou,50,,,504860000D0127,,,,,,,,,,,,,0,,,,,P,prés,,,5107,-1.633759,49.426725
2019-761171,2019-11-18,000001,Vente,45550,,,LA PETITE MERIELLERIE,B490,50390,50486,Saint-Jacques-de-Néhou,50,,,504860000D0132,,,,,,,,,,,,,0,,,,,P,prés,,,5940,-1.634681,49.425299
2019-761171,2019-11-18,000001,Vente,45550,,,LA PETITE MERIELLERIE,B490,50390,50486,Saint-Jacques-de-Néhou,50,,,504860000D0134,,,,,,,,,,,,,0,,,,,P,prés,,,10501,-1.634604,49.42618
2019-761171,2019-11-18,000001,Vente,45550,,,LA LANDE ES VAUX,B412,50390,50486,Saint-Jacques-de-Néhou,50,,,504860000D0135,,,,,,,,,,,,,0,,,,,P,prés,,,11526,-1.634356,49.42721
2019-761171,2019-11-18,000001,Vente,45550,,,LA LANDE,B407,50390,50486,Saint-Jacques-de-Néhou,50,,,504860000D0485,,,,,,,,,,,,,0,,,,,P,prés,,,8190,-1.640146,49.423948
2019-761171,2019-11-18,000001,Vente,45550,,,LES ESSARTS,B273,50390,50486,Saint-Jacques-de-Néhou,50,,,504860000D0504,,,,,,,,,,,,,0,,,,,P,prés,,,4513,-1.633591,49.424742
2019-761171,2019-11-18,000001,Vente,45550,,,LES ESSARTS,B273,50390,50486,Saint-Jacques-de-Néhou,50,,,504860000D0505,,,,,,,,,,,,,0,,,,,P,prés,,,4498,-1.632155,49.424839
2019-761171,2019-11-18,000001,Vente,45550,,,LES ESSARTS,B273,50390,50486,Saint-Jacques-de-Néhou,50,,,504860000D0506,,,,,,,,,,,,,0,,,,,P,prés,,,2641,-1.632311,49.424432
2019-761171,2019-11-18,000001,Vente,45550,,,LES ESSARTS,B273,50390,50486,Saint-Jacques-de-Néhou,50,,,504860000D0507,,,,,,,,,,,,,0,,,,,P,prés,,,3623,-1.633338,49.424289
2019-761171,2019-11-18,000001,Vente,45550,,,LES ESSARTS,B273,50390,50486,Saint-Jacques-de-Néhou,50,,,504860000D0508,,,,,,,,,,,,,0,,,,,P,prés,,,2243,-1.632209,49.424113
2019-761171,2019-11-18,000001,Vente,45550,,,LE CLOS DE LA LANDE,B131,50390,50486,Saint-Jacques-de-Néhou,50,,,504860000D0763,,,,,,,,,,,,,0,,,,,P,prés,,,6230,-1.644555,49.424529
2019-761171,2019-11-18,000001,Vente,45550,,,LES ESSARTS,B273,50390,50486,Saint-Jacques-de-Néhou,50,,,504860000D0879,,,,,,,,,,,,,0,,,,,P,prés,,,13232,-1.634923,49.424399
2019-761172,2019-10-18,000002,Vente,76417,,,LA BUTTE MERCIOT,B052,50390,50486,Saint-Jacques-de-Néhou,50,,,504860000E0010,,,,,,,,,,,,,0,,,,,P,prés,,,50405,-1.620904,49.4375
2019-761172,2019-10-18,000002,Vente,76417,,,LA LANDE ES VAUX,B412,50390,50486,Saint-Jacques-de-Néhou,50,,,504860000E0022,,,,,,,,,,,,,0,,,,,P,prés,,,16840,-1.618376,49.433561
2019-761172,2019-10-18,000002,Vente,76417,,,LA LANDE ES VAUX,B412,50390,50486,Saint-Jacques-de-Néhou,50,,,504860000E0023,,,,,,,,,,,,,0,,,,,P,prés,,,14416,-1.619303,49.434399
2019-761172,2019-10-18,000002,Vente,76417,,,LA LANDE ES VAUX,B412,50390,50486,Saint-Jacques-de-Néhou,50,,,504860000E0024,,,,,,,,,,,,,0,,,,,P,prés,,,13088,-1.620977,49.435492
2019-761172,2019-10-18,000002,Vente,76417,,,LE BAS BUISSON,B011,50390,50486,Saint-Jacques-de-Néhou,50,,,504860000E0773,,,,,,,,,,,,,0,,,,,P,prés,,,21646,-1.617468,49.43703
2019-761326,2019-11-26,000001,Vente,80000,14,,LE BOURG,B689,50390,50486,Saint-Jacques-de-Néhou,50,,,504860000C0342,,,,,,,,,,,,,0,1,Maison,70,5,S,sols,,,1042,-1.611666,49.417839
2019-761329,2019-12-05,000001,Vente,165100,,,LE VIEUX JARDIN,B679,50390,50486,Saint-Jacques-de-Néhou,50,,,504860000D0213,,,,,,,,,,,,,0,,,,,P,prés,,,695,-1.643364,49.430881
2019-761329,2019-12-05,000001,Vente,165100,,,LES JARDINS,B403,50390,50486,Saint-Jacques-de-Néhou,50,,,504860000D0214,,,,,,,,,,,,,0,,,,,P,prés,,,440,-1.64373,49.431196
2019-761329,2019-12-05,000001,Vente,165100,12,,RTE DU HAMEAU TRAVERS,0110,50390,50486,Saint-Jacques-de-Néhou,50,,,504860000D0215,,,,,,,,,,,,,0,1,Maison,80,3,P,prés,,,3763,-1.643207,49.431293
2019-761329,2019-12-05,000001,Vente,165100,12,,RTE DU HAMEAU TRAVERS,0110,50390,50486,Saint-Jacques-de-Néhou,50,,,504860000D0215,,,,,,,,,,,,,0,1,Maison,80,3,S,sols,,,500,-1.643207,49.431293
