id_mutation,date_mutation,numero_disposition,nature_mutation,valeur_fonciere,adresse_numero,adresse_suffixe,adresse_nom_voie,adresse_code_voie,code_postal,code_commune,nom_commune,code_departement,ancien_code_commune,ancien_nom_commune,id_parcelle,ancien_id_parcelle,numero_volume,lot1_numero,lot1_surface_carrez,lot2_numero,lot2_surface_carrez,lot3_numero,lot3_surface_carrez,lot4_numero,lot4_surface_carrez,lot5_numero,lot5_surface_carrez,nombre_lots,code_type_local,type_local,surface_reelle_bati,nombre_pieces_principales,code_nature_culture,nature_culture,code_nature_culture_speciale,nature_culture_speciale,surface_terrain,longitude,latitude
2019-761574,2019-01-19,000001,Vente,46000,,,LE VILLAGE NORD,B090,51240,51482,Saint-Germain-la-Ville,51,,,51482000AA0256,,,,,,,,,,,,,0,,,,,AB,terrains a bâtir,,,869,4.445745,48.886113
2019-761689,2019-01-29,000001,Vente,105200,4,,RUE DE MARSON,0039,51240,51482,Saint-Germain-la-Ville,51,,,51482000AB0162,,,,,,,,,,,,,0,1,Maison,120,4,S,sols,,,540,4.449621,48.881032
2019-762105,2019-03-21,000001,Vente,155000,6,,RUE DE CHALONS,0010,51240,51482,Saint-Germain-la-Ville,51,,,51482000AA0051,,,,,,,,,,,,,0,1,Maison,97,6,S,sols,,,966,4.446798,48.885166
2019-762255,2019-06-21,000001,Vente,47061,,,LE MOULIN,B055,51240,51482,Saint-Germain-la-Ville,51,,,51482000YB0007,,,,,,,,,,,,,0,,,,,T,terres,,,18384,4.461857,48.89297
2019-762255,2019-06-21,000001,Vente,47061,,,LA FOSSE DES CUGNOTS,B025,51240,51482,Saint-Germain-la-Ville,51,,,51482000ZA0011,,,,,,,,,,,,,0,,,,,T,terres,,,12990,4.434696,48.879432
2019-762414,2019-07-17,000001,Vente,160000,6,,RUE L OREE DU BOIS,0050,51240,51482,Saint-Germain-la-Ville,51,,,51482000AC0102,,,,,,,,,,,,,0,1,Maison,88,3,S,sols,,,730,4.45498,48.882461
2019-762472,2019-07-02,000001,Vente,185000,9,,RUE L OREE DU BOIS,0050,51240,51482,Saint-Germain-la-Ville,51,,,51482000AC0124,,,,,,,,,,,,,0,1,Maison,169,6,S,sols,,,892,4.456608,48.88306
2019-762848,2019-10-05,000001,Vente,200,,,LE VILLAGE SUD,B091,51240,51482,Saint-Germain-la-Ville,51,,,51482000AB0112,,,,,,,,,,,,,0,,,,,BS,taillis sous futaie,,,717,4.450998,48.884078
2019-763010,2019-10-25,000002,Vente,160000,,,LE VILLAGE SUD,B091,51240,51482,Saint-Germain-la-Ville,51,,,51482000AB0287,,,,,,,,,,,,,0,,,,,P,prés,,,124,4.449132,48.88172
2019-763010,2019-10-25,000002,Vente,160000,29,,RUE DE CHALONS,0010,51240,51482,Saint-Germain-la-Ville,51,,,51482000AB0331,,,,,,,,,,,,,0,1,Maison,104,4,S,sols,,,1410,4.449264,48.881558
2019-763053,2019-11-08,000001,Vente,1005,,,LA CARPIERE,B009,51240,51482,Saint-Germain-la-Ville,51,,,514820000A1818,,,,,,,,,,,,,0,,,,,BS,taillis sous futaie,,,2010,4.426694,48.879654
2019-763162,2019-12-13,000001,Vente,236000,14,,RLE CREPION,0013,51240,51482,Saint-Germain-la-Ville,51,,,51482000AA0267,,,,,,,,,,,,,0,1,Maison,113,5,S,sols,,,485,4.443064,48.882611
2019-763162,2019-12-13,000001,Vente,236000,,,LE VILLAGE NORD,B090,51240,51482,Saint-Germain-la-Ville,51,,,51482000AA0270,,,,,,,,,,,,,0,,,,,AB,terrains a bâtir,,,165,4.442926,48.882644
