id_mutation,date_mutation,numero_disposition,nature_mutation,valeur_fonciere,adresse_numero,adresse_suffixe,adresse_nom_voie,adresse_code_voie,code_postal,code_commune,nom_commune,code_departement,ancien_code_commune,ancien_nom_commune,id_parcelle,ancien_id_parcelle,numero_volume,lot1_numero,lot1_surface_carrez,lot2_numero,lot2_surface_carrez,lot3_numero,lot3_surface_carrez,lot4_numero,lot4_surface_carrez,lot5_numero,lot5_surface_carrez,nombre_lots,code_type_local,type_local,surface_reelle_bati,nombre_pieces_principales,code_nature_culture,nature_culture,code_nature_culture_speciale,nature_culture_speciale,surface_terrain,longitude,latitude
2019-777226,2019-01-09,000001,Vente,12000,,,LES CHAPPES,B016,52130,52079,Brousseval,52,,,520790000C1160,,,,,,,,,,,,,0,,,,,L,landes,FRICH,Friche,187,4.962618,48.492802
2019-777226,2019-01-09,000001,Vente,12000,,,LES CHAPPES,B016,52130,52079,Brousseval,52,,,520790000C1160,,,,,,,,,,,,,0,,,,,S,sols,,,59,4.962618,48.492802
2019-777226,2019-01-09,000001,Vente,12000,,,LES CHAPPES,B016,52130,52079,Brousseval,52,,,520790000C1161,,,,,,,,,,,,,0,,,,,J,jardins,,,181,4.962555,48.492866
2019-777226,2019-01-09,000001,Vente,12000,,,LES CHAPPES,B016,52130,52079,Brousseval,52,,,520790000C1161,,,,,,,,,,,,,0,,,,,S,sols,,,60,4.962555,48.492866
2019-777226,2019-01-09,000001,Vente,12000,,,LES CHAPPES,B016,52130,52079,Brousseval,52,,,520790000C1162,,,,,,,,,,,,,0,,,,,J,jardins,,,200,4.962479,48.492874
2019-777226,2019-01-09,000001,Vente,12000,,,LES CHAPPES,B016,52130,52079,Brousseval,52,,,520790000C1162,,,,,,,,,,,,,0,,,,,S,sols,,,30,4.962479,48.492874
2019-777359,2019-02-19,000001,Vente,111050,19,,RUE ANDRE LANG,0002,52130,52079,Brousseval,52,,,520790000C1076,,,,,,,,,,,,,0,1,Maison,99,5,S,sols,,,699,4.958797,48.486985
2019-777552,2019-04-09,000001,Vente,3500,71,,RUE DU GEN DE GAULLE,0015,52130,52079,Brousseval,52,,,520790000C1016,,,,,,,,,,,,,0,1,Maison,60,2,S,sols,,,119,4.962802,48.493102
2019-777553,2019-04-09,000001,Vente,6500,117,,RUE DU GEN DE GAULLE,0015,52130,52079,Brousseval,52,,,520790000C0988,,,,,,,,,,,,,0,1,Maison,60,2,S,sols,,,70,4.961008,48.493396
2019-777572,2019-05-10,000001,Vente,1500,,,VIGNE DES FOURCHES,B101,52130,52079,Brousseval,52,,,52079000ZA0027,,,,,,,,,,,,,0,,,,,T,terres,,,2100,4.956528,48.488011
2019-777688,2019-05-20,000001,Vente,17000,15,,RUE DE COLOMBEY,0008,52130,52079,Brousseval,52,,,520790000C0154,,,,,,,,,,,,,0,1,Maison,67,3,S,sols,,,209,4.968388,48.491162
2019-777688,2019-05-20,000001,Vente,17000,,,LE VILLAGE EST,B103,52130,52079,Brousseval,52,,,520790000C1258,,,,,,,,,,,,,0,,,,,S,sols,,,173,4.96822,48.491081
2019-777737,2019-06-03,000001,Vente,7124,,,LE VILLAGE OUEST,B104,52130,52079,Brousseval,52,,,520790000C1442,,,,,,,,,,,,,0,,,,,J,jardins,,,548,4.966148,48.490729
2019-777784,2019-06-17,000002,Vente,7500,,,VIGNE DES FOURCHES,B101,52130,52079,Brousseval,52,,,52079000ZA0062,,,,,,,,,,,,,0,,,,,T,terres,,,1500,4.956368,48.485984
2019-777785,2019-06-13,000001,Vente,11850,,,VIGNE DES FOURCHES,B101,52130,52079,Brousseval,52,,,52079000ZA0063,,,,,,,,,,,,,0,,,,,T,terres,,,2370,4.955725,48.485523
2019-777807,2019-07-05,000001,Vente,62790,2,,RUE JEAN MARIE CHIROL,0029,52130,52079,Brousseval,52,,,520790000C1451,,,,,,,,,,,,,0,1,Maison,86,4,S,sols,,,228,4.965163,48.492351
2019-777807,2019-07-05,000001,Vente,62790,,,LE VILLAGE OUEST,B104,52130,52079,Brousseval,52,,,520790000C1452,,,,,,,,,,,,,0,,,,,S,sols,,,94,4.965188,48.492283
2019-777966,2019-08-06,000001,Vente,15000,1,,RUE DU MOULIN,0023,52130,52079,Brousseval,52,,,520790000C0914,,,,,,,,,,,,,0,1,Maison,55,3,S,sols,,,60,4.966132,48.491862
2019-777966,2019-08-06,000001,Vente,15000,,,LE VILLAGE OUEST,B104,52130,52079,Brousseval,52,,,520790000C0916,,,,,,,,,,,,,0,,,,,S,sols,,,39,4.966086,48.491863
2019-777966,2019-08-06,000001,Vente,15000,,,LE VILLAGE OUEST,B104,52130,52079,Brousseval,52,,,520790000C1186,,,,,,,,,,,,,0,,,,,S,sols,,,43,4.966093,48.491939
2019-777966,2019-08-06,000001,Vente,15000,,,LE VILLAGE OUEST,B104,52130,52079,Brousseval,52,,,520790000C1188,,,,,,,,,,,,,0,,,,,S,sols,,,194,4.965932,48.491911
2019-777966,2019-08-06,000001,Vente,15000,,,LE VILLAGE OUEST,B104,52130,52079,Brousseval,52,,,520790000C1198,,,,,,,,,,,,,0,,,,,J,jardins,,,143,4.966499,48.491364
2019-778073,2019-08-21,000001,Vente,70000,2,,RUE ANDRE LANG,0002,52130,52079,Brousseval,52,,,520790000C0869,,,,,,,,,,,,,0,1,Maison,87,4,S,sols,,,690,4.961537,48.488597
2019-778073,2019-08-21,000001,Vente,70000,,,LES GRANDES ROIES,B051,52130,52079,Brousseval,52,,,520790000C1142,,,,,,,,,,,,,0,,,,,J,jardins,,,343,4.961487,48.488675
2019-778204,2019-09-24,000001,Vente,93500,8,,QUAI DU CANAL,0007,52130,52079,Brousseval,52,,,520790000C0908,,,,,,,,,,,,,0,1,Maison,78,4,T,terres,,,671,4.960657,48.490931
2019-778204,2019-09-24,000001,Vente,93500,8,,QUAI DU CANAL,0007,52130,52079,Brousseval,52,,,520790000C0908,,,,,,,,,,,,,0,1,Maison,78,4,S,sols,,,513,4.960657,48.490931
2019-778212,2019-09-24,000001,Vente,330,,,LES PETITS CHAMPS,B075,52130,52079,Brousseval,52,,,520790000C1427,,,,,,,,,,,,,0,,,,,E,eaux,,,33,4.960975,48.493319
2019-778296,2019-10-18,000001,Vente,114500,1,,RUE DES PEUPLIERS,0035,52130,52079,Brousseval,52,,,52079000ZH0141,,,,,,,,,,,,,0,1,Maison,109,5,S,sols,,,704,4.968463,48.494078
2019-778464,2019-11-30,000001,Vente,19000,3,,RUE DU MOULIN,0023,52130,52079,Brousseval,52,,,520790000C0915,,,,,,,,,,,,,0,1,Maison,66,3,S,sols,,,140,4.96621,48.491685
2019-778464,2019-11-30,000001,Vente,19000,,,LE VILLAGE OUEST,B104,52130,52079,Brousseval,52,,,520790000C0917,,,,,,,,,,,,,0,,,,,S,sols,,,100,4.966173,48.491677
2019-778464,2019-11-30,000001,Vente,19000,,,LE VILLAGE OUEST,B104,52130,52079,Brousseval,52,,,520790000C1189,,,,,,,,,,,,,0,,,,,S,sols,,,277,4.966011,48.491617
2019-778464,2019-11-30,000001,Vente,19000,,,LE VILLAGE OUEST,B104,52130,52079,Brousseval,52,,,520790000C1197,,,,,,,,,,,,,0,,,,,J,jardins,,,130,4.966413,48.491304
2019-778476,2019-12-12,000001,Vente,10200,,,LE BLANCHERON,B009,52130,52079,Brousseval,52,,,52079000ZE0023,,,,,,,,,,,,,0,,,,,S,sols,,,1420,4.972297,48.492188
2019-778515,2019-11-26,000001,Vente,28000,48,,RUE DU GEN DE GAULLE,0015,52130,52079,Brousseval,52,,,52079000ZH0085,,,,,,,,,,,,,0,1,Maison,52,3,S,sols,,,142,4.963635,48.493262
2019-778550,2019-12-20,000001,Vente,65000,33,,RUE DE COLOMBEY,0008,52130,52079,Brousseval,52,,,520790000C0856,,,,,,,,,,,,,0,4,Local industriel. commercial ou assimilé,196,0,S,sols,,,564,4.969085,48.490398
2019-778550,2019-12-20,000001,Vente,65000,33,,RUE DE COLOMBEY,0008,52130,52079,Brousseval,52,,,520790000C0856,,,,,,,,,,,,,0,1,Maison,105,5,S,sols,,,564,4.969085,48.490398
2019-778550,2019-12-20,000001,Vente,65000,,,LE VILLAGE EST,B103,52130,52079,Brousseval,52,,,520790000C0858,,,,,,,,,,,,,0,,,,,J,jardins,,,331,4.969373,48.490547
