id_mutation,date_mutation,numero_disposition,nature_mutation,valeur_fonciere,adresse_numero,adresse_suffixe,adresse_nom_voie,adresse_code_voie,code_postal,code_commune,nom_commune,code_departement,ancien_code_commune,ancien_nom_commune,id_parcelle,ancien_id_parcelle,numero_volume,lot1_numero,lot1_surface_carrez,lot2_numero,lot2_surface_carrez,lot3_numero,lot3_surface_carrez,lot4_numero,lot4_surface_carrez,lot5_numero,lot5_surface_carrez,nombre_lots,code_type_local,type_local,surface_reelle_bati,nombre_pieces_principales,code_nature_culture,nature_culture,code_nature_culture_speciale,nature_culture_speciale,surface_terrain,longitude,latitude
2019-774432,2019-01-02,000001,Vente,45000,,,VILLAGE,B062,52000,52349,Neuilly-sur-Suize,52,,,523490000A0362,,,,,,,,,,,,,0,,,,,T,terres,,,145,5.147397,48.051204
2019-774432,2019-01-02,000001,Vente,45000,7,,RUE DE LA VALLEE,0105,52000,52349,Neuilly-sur-Suize,52,,,523490000A0698,,,,,,,,,,,,,0,3,Dépendance,,0,P,prés,,,2528,5.147241,48.051033
2019-774432,2019-01-02,000001,Vente,45000,7,,RUE DE LA VALLEE,0105,52000,52349,Neuilly-sur-Suize,52,,,523490000A0698,,,,,,,,,,,,,0,3,Dépendance,,0,S,sols,,,502,5.147241,48.051033
2019-774516,2019-01-31,000001,Vente,86000,35,,RUE PAUL CORNUOT,0080,52000,52349,Neuilly-sur-Suize,52,,,523490000A0838,,,,,,,,,,,,,0,1,Maison,92,4,S,sols,,,325,5.151156,48.048696
2019-774516,2019-01-31,000002,Vente,86000,35,,RUE PAUL CORNUOT,0080,52000,52349,Neuilly-sur-Suize,52,,,523490000A0838,,,,,,,,,,,,,0,1,Maison,92,4,S,sols,,,325,5.151156,48.048696
2019-775975,2019-07-26,000001,Vente,750000,1,,RUE DE L EGLISE,0050,52000,52349,Neuilly-sur-Suize,52,,,523490000A0426,,,,,,,,,,,,,0,4,Local industriel. commercial ou assimilé,,0,S,sols,,,1800,5.149466,48.049862
2019-775975,2019-07-26,000001,Vente,750000,,,VILLAGE,B062,52000,52349,Neuilly-sur-Suize,52,,,523490000A0429,,,,,,,,,,,,,0,,,,,E,eaux,BIEF,Bief,220,5.148916,48.050118
2019-775975,2019-07-26,000001,Vente,750000,,,VILLAGE,B062,52000,52349,Neuilly-sur-Suize,52,,,523490000A0430,,,,,,,,,,,,,0,,,,,P,prés,,,1149,5.14868,48.050151
2019-775975,2019-07-26,000001,Vente,750000,,,VILLAGE,B062,52000,52349,Neuilly-sur-Suize,52,,,523490000A0431,,,,,,,,,,,,,0,,,,,E,eaux,BIEF,Bief,230,5.148401,48.050228
2019-775975,2019-07-26,000001,Vente,750000,,,VILLAGE,B062,52000,52349,Neuilly-sur-Suize,52,,,523490000A0433,,,,,,,,,,,,,0,,,,,T,terres,,,650,5.148342,48.050289
2019-775975,2019-07-26,000001,Vente,750000,,,VILLAGE,B062,52000,52349,Neuilly-sur-Suize,52,,,523490000A0434,,,,,,,,,,,,,0,,,,,BS,taillis sous futaie,,,1260,5.148921,48.049613
2019-775975,2019-07-26,000001,Vente,750000,,,VILLAGE,B062,52000,52349,Neuilly-sur-Suize,52,,,523490000A0435,,,,,,,,,,,,,0,,,,,J,jardins,,,2700,5.148711,48.049567
2019-775975,2019-07-26,000001,Vente,750000,,,VILLAGE,B062,52000,52349,Neuilly-sur-Suize,52,,,523490000A0436,,,,,,,,,,,,,0,,,,,BS,taillis sous futaie,,,310,5.148099,48.04979
2019-775975,2019-07-26,000001,Vente,750000,,,VILLAGE,B062,52000,52349,Neuilly-sur-Suize,52,,,523490000A0437,,,,,,,,,,,,,0,,,,,S,sols,,,460,5.148821,48.049455
2019-775975,2019-07-26,000001,Vente,750000,,,VILLAGE,B062,52000,52349,Neuilly-sur-Suize,52,,,523490000A0437,,,,,,,,,,,,,0,,,,,J,jardins,,,2840,5.148821,48.049455
2019-775975,2019-07-26,000001,Vente,750000,,,VILLAGE,B062,52000,52349,Neuilly-sur-Suize,52,,,523490000A0438,,,,,,,,,,,,,0,,,,,J,jardins,,,1250,5.149185,48.049013
2019-775975,2019-07-26,000001,Vente,750000,,,VILLAGE,B062,52000,52349,Neuilly-sur-Suize,52,,,523490000A0629,,,,,,,,,,,,,0,,,,,P,prés,,,66,5.148718,48.050312
2019-775975,2019-07-26,000001,Vente,750000,,,VILLAGE,B062,52000,52349,Neuilly-sur-Suize,52,,,523490000A0632,,,,,,,,,,,,,0,,,,,P,prés,,,1624,5.14908,48.050116
2019-776311,2019-09-25,000001,Vente,60000,,,LA COMBE BOUGENOT,B015,52000,52349,Neuilly-sur-Suize,52,,,523490000A0558,,,,,,,,,,,,,0,,,,,T,terres,,,72,5.145656,48.048594
2019-776311,2019-09-25,000001,Vente,60000,12,,RUE DE LA ROCHE VILLARD,0095,52000,52349,Neuilly-sur-Suize,52,,,523490000A0581,,,,,,,,,,,,,0,1,Maison,57,1,S,sols,,,262,5.145847,48.048594
2019-776311,2019-09-25,000001,Vente,60000,,,LA COMBE BOUGENOT,B015,52000,52349,Neuilly-sur-Suize,52,,,523490000A0639,,,,,,,,,,,,,0,,,,,VE,vergers,,,355,5.145708,48.048706
2019-777043,2019-12-18,000001,Vente,50000,,,VILLAGE,B062,52000,52349,Neuilly-sur-Suize,52,,,523490000A0399,,,,,,,,,,,,,0,,,,,P,prés,,,2606,5.15196,48.048628
2019-777043,2019-12-18,000001,Vente,50000,39,,RUE PAUL CORNUOT,0080,52000,52349,Neuilly-sur-Suize,52,,,523490000A0528,,,,,,,,,,,,,0,1,Maison,50,1,S,sols,,,1550,5.15149,48.048422
2019-777043,2019-12-18,000001,Vente,50000,39,,RUE PAUL CORNUOT,0080,52000,52349,Neuilly-sur-Suize,52,,,523490000A0528,,,,,,,,,,,,,0,1,Maison,100,4,S,sols,,,1550,5.15149,48.048422
2019-777043,2019-12-18,000001,Vente,50000,,,SUR LA QUEUROTTE,B051,52000,52349,Neuilly-sur-Suize,52,,,523490000A0541,,,,,,,,,,,,,0,,,,,BT,taillis simples,,,8057,5.153312,48.054364
2019-777043,2019-12-18,000001,Vente,50000,,,REFOUR,B053,52000,52349,Neuilly-sur-Suize,52,,,52349000ZA0023,,,,,,,,,,,,,0,,,,,BR,futaies résineuses,,,3269,5.153741,48.054624
2019-777043,2019-12-18,000001,Vente,50000,,,REFOUR,B053,52000,52349,Neuilly-sur-Suize,52,,,52349000ZA0023,,,,,,,,,,,,,0,,,,,BT,taillis simples,,,2781,5.153741,48.054624
