id_mutation,date_mutation,numero_disposition,nature_mutation,valeur_fonciere,adresse_numero,adresse_suffixe,adresse_nom_voie,adresse_code_voie,code_postal,code_commune,nom_commune,code_departement,ancien_code_commune,ancien_nom_commune,id_parcelle,ancien_id_parcelle,numero_volume,lot1_numero,lot1_surface_carrez,lot2_numero,lot2_surface_carrez,lot3_numero,lot3_surface_carrez,lot4_numero,lot4_surface_carrez,lot5_numero,lot5_surface_carrez,nombre_lots,code_type_local,type_local,surface_reelle_bati,nombre_pieces_principales,code_nature_culture,nature_culture,code_nature_culture_speciale,nature_culture_speciale,surface_terrain,longitude,latitude
2019-774632,2019-02-05,000001,Vente,3000,,,LA CORVEE,B078,52500,52438,Rougeux,52,,,52438000ZB0082,,,,,,,,,,,,,0,,,,,P,prés,,,5852,5.585841,47.811226
2019-774632,2019-02-05,000001,Vente,3000,,,LA CORVEE,B078,52500,52438,Rougeux,52,,,52438000ZB0082,,,,,,,,,,,,,0,,,,,VE,vergers,,,3408,5.585841,47.811226
2019-774632,2019-02-05,000001,Vente,3000,,,LA CORVEE,B078,52500,52438,Rougeux,52,,,52438000ZB0082,,,,,,,,,,,,,0,,,,,P,prés,,,5853,5.585841,47.811226
2019-775171,2019-04-16,000002,Vente,4000,40,,RUE DES LAVANDIERES,0045,52500,52438,Rougeux,52,,,524380000B0083,,,,,,,,,,,,,0,1,Maison,32,1,S,sols,,,283,5.579809,47.810402
2019-775171,2019-04-16,000002,Vente,4000,,,VILLAGE SUD,B100,52500,52438,Rougeux,52,,,52438000ZD0118,,,,,,,,,,,,,0,,,,,S,sols,,,397,5.579802,47.810185
2019-776365,2019-09-18,000001,Vente,800,,,FAULET,B034,52500,52438,Rougeux,52,,,524380000B0556,,,,,,,,,,,,,0,,,,,BT,taillis simples,,,1776,5.589953,47.809549
2019-776365,2019-09-18,000001,Vente,800,,,HAUT DE LA CHAUME,B050,52500,52438,Rougeux,52,,,524380000C0529,,,,,,,,,,,,,0,,,,,BT,taillis simples,,,3155,5.595342,47.812637
2019-776365,2019-09-18,000001,Vente,800,,,FAULET,B034,52500,52438,Rougeux,52,,,52438000ZD0098,,,,,,,,,,,,,0,,,,,BT,taillis simples,,,1650,5.593941,47.811209
