id_mutation,date_mutation,numero_disposition,nature_mutation,valeur_fonciere,adresse_numero,adresse_suffixe,adresse_nom_voie,adresse_code_voie,code_postal,code_commune,nom_commune,code_departement,ancien_code_commune,ancien_nom_commune,id_parcelle,ancien_id_parcelle,numero_volume,lot1_numero,lot1_surface_carrez,lot2_numero,lot2_surface_carrez,lot3_numero,lot3_surface_carrez,lot4_numero,lot4_surface_carrez,lot5_numero,lot5_surface_carrez,nombre_lots,code_type_local,type_local,surface_reelle_bati,nombre_pieces_principales,code_nature_culture,nature_culture,code_nature_culture_speciale,nature_culture_speciale,surface_terrain,longitude,latitude
2019-778695,2019-01-16,000001,Vente,1300,15,B,RTE DU MANS,0280,53480,53267,Vaiges,53,,,53267000AA0339,,,,,,,,,,,,,0,,,,,S,sols,,,59,-0.475204,48.038788
2019-778698,2019-01-16,000002,Vente,33700,15,,RTE DU MANS,0280,53480,53267,Vaiges,53,,,53267000AA0338,,,,,,,,,,,,,0,1,Maison,70,4,S,sols,,,168,-0.475206,48.038869
2019-778768,2019-01-18,000001,Vente,190700,5271,,LES GUETTERIES,B712,53480,53267,Vaiges,53,,,53267000ZC0030,,,,,,,,,,,,,0,1,Maison,110,3,S,sols,,,4135,-0.435388,48.053574
2019-778768,2019-01-18,000001,Vente,190700,5271,,LES GUETTERIES,B712,53480,53267,Vaiges,53,,,53267000ZC0030,,,,,,,,,,,,,0,1,Maison,110,3,VE,vergers,,,3139,-0.435388,48.053574
2019-778768,2019-01-18,000001,Vente,190700,5271,,LES GUETTERIES,B712,53480,53267,Vaiges,53,,,53267000ZC0030,,,,,,,,,,,,,0,1,Maison,110,3,T,terres,,,18074,-0.435388,48.053574
2019-778883,2019-02-07,000001,Vente,24400.03,17,,RUE DE LA ROSELIERE,0508,53480,53267,Vaiges,53,,,53267000ZK0270,,,,,,,,,,,,,0,,,,,AB,terrains a bâtir,,,591,-0.46815,48.037979
2019-778887,2019-02-07,000001,Vente,26051.47,2,,RUE DE LA ROSELIERE,0508,53480,53267,Vaiges,53,,,53267000ZK0253,,,,,,,,,,,,,0,,,,,AB,terrains a bâtir,,,631,-0.470563,48.038512
2019-778888,2019-01-29,000001,Vente,35000,5,,RUE DE RICHEBOURG,0340,53480,53267,Vaiges,53,,,53267000AC0006,,,,,,,,,,,,,0,1,Maison,115,4,S,sols,,,520,-0.476195,48.040405
2019-779208,2019-03-20,000001,Vente,87410,,,LA LANDE DU BAS TAILLIS,B789,53480,53267,Vaiges,53,,,53267000ZK0079,,,,,,,,,,,,,0,,,,,S,sols,,,50,-0.469832,48.033662
2019-779208,2019-03-20,000001,Vente,87410,,,LA LANDE DU BAS TAILLIS,B789,53480,53267,Vaiges,53,,,53267000ZK0079,,,,,,,,,,,,,0,,,,,J,jardins,,,350,-0.469832,48.033662
2019-779208,2019-03-20,000001,Vente,87410,1,,LE BAS TAILLIS,B065,53480,53267,Vaiges,53,,,53267000ZK0080,,,,,,,,,,,,,0,1,Maison,145,5,S,sols,,,225,-0.46958,48.033456
2019-779208,2019-03-20,000001,Vente,87410,,,LE VERGER,C413,53480,53267,Vaiges,53,,,53267000ZK0086,,,,,,,,,,,,,0,,,,,VE,vergers,,,780,-0.468882,48.032845
2019-779208,2019-03-20,000001,Vente,87410,,,LE VERGER,C413,53480,53267,Vaiges,53,,,53267000ZK0087,,,,,,,,,,,,,0,,,,,VE,vergers,,,440,-0.468846,48.032663
2019-779232,2019-03-15,000001,Vente,48000,10,,RUE DES LILAS,0210,53480,53267,Vaiges,53,,,53267000AC0078,,,,,,,,,,,,,0,1,Maison,61,3,S,sols,,,433,-0.473781,48.041654
2019-779334,2019-03-19,000001,Vente,20000,5000,F,RTE DU CHAMMES,0100,53480,53267,Vaiges,53,,,53267000AC0141,,,,,,,,,,,,,0,1,Maison,64,2,S,sols,,,2330,-0.473399,48.044504
2019-779374,2019-04-01,000001,Vente,23120.16,4,,RUE DE LA ROSELIERE,0508,53480,53267,Vaiges,53,,,53267000ZK0254,,,,,,,,,,,,,0,,,,,AB,terrains a bâtir,,,560,-0.470141,48.038554
2019-779513,2019-04-04,000001,Vente,175000,5000,F,LE CLOS DE L'AUBEPINE,C503,53480,53267,Vaiges,53,,,53267000YI0025,,,,,,,,,,,,,0,,,,,S,sols,,,500,-0.494079,48.070276
2019-779513,2019-04-04,000001,Vente,175000,5000,F,LE CLOS DE L'AUBEPINE,C503,53480,53267,Vaiges,53,,,53267000YI0025,,,,,,,,,,,,,0,,,,,T,terres,,,10633,-0.494079,48.070276
2019-779568,2019-04-16,000001,Vente,72500,12,,RUE DE LA ROSELIERE,0508,53480,53267,Vaiges,53,,,53267000ZK0286,,,,,,,,,,,,,0,1,Maison,98,4,AB,terrains a bâtir,,,554,-0.469875,48.037675
2019-779674,2019-04-16,000001,Vente,164000,1730,,RTE DE CHEMERE,0106,53480,53267,Vaiges,53,,,53267000ZS0013,,,,,,,,,,,,,0,1,Maison,140,5,J,jardins,,,1219,-0.46723,48.021289
2019-779674,2019-04-16,000001,Vente,164000,1730,,RTE DE CHEMERE,0106,53480,53267,Vaiges,53,,,53267000ZS0013,,,,,,,,,,,,,0,1,Maison,140,5,S,sols,,,221,-0.46723,48.021289
2019-779884,2019-05-24,000001,Vente,12000,,,LA GADILLERAIE,B560,53480,53267,Vaiges,53,,,53267000ZK0189,,,,,,,,,,,,,0,,,,,T,terres,,,1106,-0.456094,48.035905
2019-779884,2019-05-24,000001,Vente,12000,,,LA GADILLERAIE,B560,53480,53267,Vaiges,53,,,53267000ZK0190,,,,,,,,,,,,,0,,,,,T,terres,,,784,-0.455912,48.035905
2019-779884,2019-05-24,000001,Vente,12000,,,LA GADILLERAIE,B560,53480,53267,Vaiges,53,,,53267000ZK0191,,,,,,,,,,,,,0,,,,,T,terres,,,12106,-0.455213,48.035848
2019-780157,2019-06-28,000001,Vente,188000,1,,RUE DES BRUYERES,0070,53480,53267,Vaiges,53,,,53267000AC0102,,,,,,,,,,,,,0,1,Maison,210,7,S,sols,,,1603,-0.473122,48.040669
2019-780174,2019-06-13,000001,Vente,1300,,,LE VERGER,C413,53480,53267,Vaiges,53,,,53267000ZK0086,,,,,,,,,,,,,0,,,,,VE,vergers,,,780,-0.468882,48.032845
2019-780174,2019-06-13,000001,Vente,1300,,,LE VERGER,C413,53480,53267,Vaiges,53,,,53267000ZK0087,,,,,,,,,,,,,0,,,,,VE,vergers,,,440,-0.468846,48.032663
2019-780177,2019-06-14,000001,Vente,15000,15,,PL DE L EGLISE,0140,53480,53267,Vaiges,53,,,53267000AC0011,,,,,,,,,,,,,0,1,Maison,68,3,S,sols,,,73,-0.476789,48.040593
2019-780186,2019-06-26,000001,Vente,65000,,,LE JARDIN DE LA MARE,B743,53480,53267,Vaiges,53,,,53267000YD0009,,,,,,,,,,,,,0,,,,,T,terres,,,18259,-0.496596,48.053592
2019-780186,2019-06-26,000001,Vente,65000,,,LE JARDIN DE LA MARE,B743,53480,53267,Vaiges,53,,,53267000YD0009,,,,,,,,,,,,,0,,,,,P,prés,,,12153,-0.496596,48.053592
2019-780186,2019-06-26,000001,Vente,65000,,,LE JARDIN DE LA MARE,B743,53480,53267,Vaiges,53,,,53267000YD0009,,,,,,,,,,,,,0,,,,,T,terres,,,54778,-0.496596,48.053592
2019-780186,2019-06-26,000001,Vente,65000,,,LA MOTTE,B883,53480,53267,Vaiges,53,,,53267000ZY0006,,,,,,,,,,,,,0,,,,,T,terres,,,20290,-0.4871,48.04864
2019-780186,2019-06-26,000001,Vente,65000,,,LA MOTTE,B883,53480,53267,Vaiges,53,,,53267000ZY0006,,,,,,,,,,,,,0,,,,,T,terres,,,20290,-0.4871,48.04864
2019-780186,2019-06-26,000001,Vente,65000,,,LA MOTTE,B883,53480,53267,Vaiges,53,,,53267000ZY0007,,,,,,,,,,,,,0,,,,,T,terres,,,9405,-0.48525,48.047063
2019-780186,2019-06-26,000001,Vente,65000,,,LA MOTTE,B883,53480,53267,Vaiges,53,,,53267000ZY0007,,,,,,,,,,,,,0,,,,,T,terres,,,3135,-0.48525,48.047063
2019-780186,2019-06-26,000001,Vente,65000,,,LE CHAMP DU CARREFOUR,B218,53480,53267,Vaiges,53,,,53267000ZY0039,,,,,,,,,,,,,0,,,,,T,terres,,,8355,-0.49585,48.049131
2019-780186,2019-06-26,000001,Vente,65000,,,LE CHAMP DU CARREFOUR,B218,53480,53267,Vaiges,53,,,53267000ZY0039,,,,,,,,,,,,,0,,,,,T,terres,,,2785,-0.49585,48.049131
2019-780283,2019-06-19,000001,Vente,230000,5282,,MONTHERMONT,B887,53480,53267,Vaiges,53,,,53267000YM0014,,,,,,,,,,,,,0,1,Maison,40,1,S,sols,,,4245,-0.465863,48.073524
2019-780283,2019-06-19,000001,Vente,230000,5282,,MONTHERMONT,B887,53480,53267,Vaiges,53,,,53267000YM0014,,,,,,,,,,,,,0,1,Maison,172,5,J,jardins,,,2468,-0.465863,48.073524
2019-780283,2019-06-19,000001,Vente,230000,5282,,MONTHERMONT,B887,53480,53267,Vaiges,53,,,53267000YM0014,,,,,,,,,,,,,0,1,Maison,40,1,P,prés,,,11300,-0.465863,48.073524
2019-780283,2019-06-19,000001,Vente,230000,5282,,MONTHERMONT,B887,53480,53267,Vaiges,53,,,53267000YM0014,,,,,,,,,,,,,0,1,Maison,40,1,BF,futaies feuillues,,,2262,-0.465863,48.073524
2019-780283,2019-06-19,000001,Vente,230000,5282,,MONTHERMONT,B887,53480,53267,Vaiges,53,,,53267000YM0014,,,,,,,,,,,,,0,1,Maison,172,5,BF,futaies feuillues,,,2262,-0.465863,48.073524
2019-780283,2019-06-19,000001,Vente,230000,5282,,MONTHERMONT,B887,53480,53267,Vaiges,53,,,53267000YM0014,,,,,,,,,,,,,0,1,Maison,172,5,P,prés,,,11300,-0.465863,48.073524
2019-780283,2019-06-19,000001,Vente,230000,5282,,MONTHERMONT,B887,53480,53267,Vaiges,53,,,53267000YM0014,,,,,,,,,,,,,0,1,Maison,40,1,J,jardins,,,2468,-0.465863,48.073524
2019-780283,2019-06-19,000001,Vente,230000,5282,,MONTHERMONT,B887,53480,53267,Vaiges,53,,,53267000YM0014,,,,,,,,,,,,,0,1,Maison,172,5,S,sols,,,4245,-0.465863,48.073524
2019-780283,2019-06-19,000001,Vente,230000,,,LE CHAMP DE LA PIERRE,B197,53480,53267,Vaiges,53,,,53267000YM0015,,,,,,,,,,,,,0,,,,,P,prés,,,7887,-0.46672,48.072495
2019-780949,2019-07-29,000001,Vente,162000,22,,RUE DU CANAL,0080,53480,53267,Vaiges,53,,,53267000ZY0066,,,,,,,,,,,,,0,1,Maison,79,3,S,sols,,,1000,-0.482201,48.0444
2019-780949,2019-07-29,000001,Vente,162000,22,,RUE DU CANAL,0080,53480,53267,Vaiges,53,,,53267000ZY0066,,,,,,,,,,,,,0,1,Maison,79,3,T,terres,,,2258,-0.482201,48.0444
2019-781015,2019-07-24,000001,Vente,120000,,,LA BIAUCHERE,B079,53480,53267,Vaiges,53,,,53267000ZI0025,,,,,,,,,,,,,0,,,,,S,sols,,,219,-0.462752,48.048446
2019-781015,2019-07-24,000001,Vente,120000,5498,,LA BIAUCHERE,B079,53480,53267,Vaiges,53,,,53267000ZI0027,,,,,,,,,,,,,0,1,Maison,117,3,T,terres,,,1614,-0.463226,48.048173
2019-781015,2019-07-24,000001,Vente,120000,5498,,LA BIAUCHERE,B079,53480,53267,Vaiges,53,,,53267000ZI0027,,,,,,,,,,,,,0,1,Maison,117,3,S,sols,,,1000,-0.463226,48.048173
2019-781015,2019-07-24,000001,Vente,120000,,,LA BIAUCHERE,B079,53480,53267,Vaiges,53,,,53267000ZI0029,,,,,,,,,,,,,0,,,,,S,sols,,,400,-0.463056,48.048519
2019-781015,2019-07-24,000001,Vente,120000,,,LA BIAUCHERE,B079,53480,53267,Vaiges,53,,,53267000ZI0029,,,,,,,,,,,,,0,,,,,T,terres,,,1186,-0.463056,48.048519
2019-781071,2019-07-17,000001,Vente,58000,6,,RUE DES ECOLES,0120,53480,53267,Vaiges,53,,,53267000AA0040,,,,,,,,,,,,,0,1,Maison,69,3,S,sols,,,40,-0.477072,48.040282
2019-781989,2019-09-06,000001,Vente,132000,4,,LE BAS TAILLIS,B065,53480,53267,Vaiges,53,,,53267000ZV0053,,,,,,,,,,,,,0,1,Maison,88,4,S,sols,,,1016,-0.469855,48.032895
2019-782186,2019-09-25,000001,Vente,83000,4,,IMP DES MARRONNIERS,0305,53480,53267,Vaiges,53,,,53267000AA0092,,,,,,,,,,,,,0,1,Maison,85,3,S,sols,,,618,-0.473614,48.039464
2019-782219,2019-10-07,000001,Vente,79000,,,LE GRAND PRE,B610,53480,53267,Vaiges,53,,,53267000YR0003,,,,,,,,,,,,,0,,,,,P,prés,,,28730,-0.479658,48.084257
2019-782384,2019-09-30,000001,Vente,25000,14,,RUE DES ROSIERS,0350,53480,53267,Vaiges,53,,,53267000AB0070,,,,,,,,,,,,,0,1,Maison,36,2,S,sols,,,1463,-0.478432,48.044116
2019-782384,2019-09-30,000001,Vente,25000,14,,RUE DES ROSIERS,0350,53480,53267,Vaiges,53,,,53267000AB0070,,,,,,,,,,,,,0,1,Maison,36,2,AG,terrains d'agrément,PARC,Parc,4405,-0.478432,48.044116
2019-782384,2019-09-30,000001,Vente,25000,,,LE PRE DES HAIES,C232,53480,53267,Vaiges,53,,,53267000AB0129,,,,,,,,,,,,,0,,,,,P,prés,,,531,-0.4787,48.044335
2019-782610,2019-10-28,000001,Vente,70000,6,,RUE ROBERT GLETRON,0345,53480,53267,Vaiges,53,,,53267000AB0015,,,,,,,,,,,,,0,1,Maison,85,5,S,sols,,,116,-0.478124,48.041287
2019-782852,2019-10-21,000001,Vente,177000,210,,CHE DES VALLEES,0410,53480,53267,Vaiges,53,,,53267000YO0023,,,,,,,,,,,,,0,1,Maison,109,4,AG,terrains d'agrément,PARC,Parc,5614,-0.500571,48.075987
2019-782852,2019-10-21,000001,Vente,177000,210,,CHE DES VALLEES,0410,53480,53267,Vaiges,53,,,53267000YO0023,,,,,,,,,,,,,0,1,Maison,109,4,S,sols,,,1810,-0.500571,48.075987
2019-783523,2019-11-29,000001,Vente,75000,5,,RUE DES FAUVETTES,0147,53480,53267,Vaiges,53,,,53267000AB0116,,,,,,,,,,,,,0,1,Maison,89,4,AB,terrains a bâtir,,,449,-0.475824,48.044051
2019-783588,2019-11-29,000002,Vente,270000,17,,RUE DES CROIX,0110,53480,53267,Vaiges,53,,,53267000AA0146,,,,,,,,,,,,,0,1,Maison,30,2,S,sols,,,2136,-0.475061,48.037154
2019-783588,2019-11-29,000002,Vente,270000,17,,RUE DES CROIX,0110,53480,53267,Vaiges,53,,,53267000AA0146,,,,,,,,,,,,,0,1,Maison,172,8,S,sols,,,2136,-0.475061,48.037154
2019-783588,2019-11-29,000002,Vente,270000,17,,RUE DES CROIX,0110,53480,53267,Vaiges,53,,,53267000AA0147,,,,,,,,,,,,,0,,,,,J,jardins,,,1062,-0.475063,48.036881
2019-783588,2019-11-29,000002,Vente,270000,17,,RUE DES CROIX,0110,53480,53267,Vaiges,53,,,53267000AA0147,,,,,,,,,,,,,0,,,,,L,landes,,,274,-0.475063,48.036881
2019-783588,2019-11-29,000002,Vente,270000,,,LES CROIX,B479,53480,53267,Vaiges,53,,,53267000AA0341,,,,,,,,,,,,,0,,,,,P,prés,,,11771,-0.475786,48.036877
2019-784204,2019-12-30,000001,Vente,160000,805,,CHE DE LA GRANDE NORMANDIERE,0512,53480,53267,Vaiges,53,,,53267000YD0108,,,,,,,,,,,,,0,4,Local industriel. commercial ou assimilé,416,0,S,sols,,,2960,-0.500311,48.057173
