id_mutation,date_mutation,numero_disposition,nature_mutation,valeur_fonciere,adresse_numero,adresse_suffixe,adresse_nom_voie,adresse_code_voie,code_postal,code_commune,nom_commune,code_departement,ancien_code_commune,ancien_nom_commune,id_parcelle,ancien_id_parcelle,numero_volume,lot1_numero,lot1_surface_carrez,lot2_numero,lot2_surface_carrez,lot3_numero,lot3_surface_carrez,lot4_numero,lot4_surface_carrez,lot5_numero,lot5_surface_carrez,nombre_lots,code_type_local,type_local,surface_reelle_bati,nombre_pieces_principales,code_nature_culture,nature_culture,code_nature_culture_speciale,nature_culture_speciale,surface_terrain,longitude,latitude
2019-790253,2019-07-10,000001,Vente,77600,,,LE VILLAGE,B071,54330,54247,Hammeville,54,,,542470000D0330,,,,,,,,,,,,,0,,,,,S,sols,,,244,6.06397,48.498492
2019-790253,2019-07-10,000001,Vente,77600,18,,RUE RENE MARTIN,0130,54330,54247,Hammeville,54,,,542470000D0331,,,,,,,,,,,,,0,1,Maison,87,3,S,sols,,,655,6.064643,48.49847
2019-790253,2019-07-10,000001,Vente,77600,,,LE VILLAGE,B071,54330,54247,Hammeville,54,,,542470000D0334,,,,,,,,,,,,,0,,,,,T,terres,,,692,6.064296,48.4986
2019-790556,2019-07-10,000001,Vente,137850,20,,RUE RENE MARTIN,0130,54330,54247,Hammeville,54,,,542470000D0039,,,,,,,,,,,,,0,1,Maison,95,4,S,sols,,,164,6.064746,48.498259
2019-790556,2019-07-10,000001,Vente,137850,,,LE VILLAGE,B071,54330,54247,Hammeville,54,,,542470000D0329,,,,,,,,,,,,,0,,,,,S,sols,,,1222,6.064546,48.498293
2019-790556,2019-07-10,000001,Vente,137850,,,LE VILLAGE,B071,54330,54247,Hammeville,54,,,542470000D0332,,,,,,,,,,,,,0,,,,,S,sols,,,67,6.064514,48.498431
2019-790556,2019-07-10,000001,Vente,137850,,,LE VILLAGE,B071,54330,54247,Hammeville,54,,,542470000D0333,,,,,,,,,,,,,0,,,,,T,terres,,,194,6.064283,48.498538
2019-793649,2019-11-07,000002,Vente,20216,,,LE VILLAGE,B071,54330,54247,Hammeville,54,,,542470000D0336,,,,,,,,,,,,,0,,,,,S,sols,,,179,6.067363,48.499093
2019-793649,2019-11-07,000002,Vente,20216,,,LE VILLAGE,B071,54330,54247,Hammeville,54,,,542470000D0338,,,,,,,,,,,,,0,,,,,S,sols,,,138,6.067231,48.498847
2019-793651,2019-11-07,000001,Vente,29784,,,LE VILLAGE,B071,54330,54247,Hammeville,54,,,542470000D0335,,,,,,,,,,,,,0,,,,,S,sols,,,204,6.067268,48.499101
2019-793651,2019-11-07,000001,Vente,29784,,,LE VILLAGE,B071,54330,54247,Hammeville,54,,,542470000D0337,,,,,,,,,,,,,0,,,,,S,sols,,,168,6.067138,48.498873
2019-794067,2019-11-08,000001,Vente,129134.77,,,LES VILLERS,B072,54330,54247,Hammeville,54,,,54247000ZD0031,,,,,,,,,,,,,0,,,,,S,sols,,,636,6.074526,48.49865
2019-794067,2019-11-08,000001,Vente,129134.77,,,LES VILLERS,B072,54330,54247,Hammeville,54,,,54247000ZD0033,,,,,,,,,,,,,0,,,,,S,sols,,,1094,6.075025,48.498462
2019-794308,2019-11-29,000001,Vente,140000,,,LA HAYOTTE,B030,54330,54247,Hammeville,54,,,542470000Y0249,,,,,,,,,,,,,0,,,,,J,jardins,,,623,6.082961,48.490995
2019-794308,2019-11-29,000001,Vente,140000,5801,,LA HAYOTTE,B030,54330,54247,Hammeville,54,,,542470000Y0250,,,,,,,,,,,,,0,1,Maison,101,5,S,sols,,,352,6.083421,48.491159
2019-794308,2019-11-29,000001,Vente,140000,,,LA HAYOTTE,B030,54330,54247,Hammeville,54,,,542470000Y0251,,,,,,,,,,,,,0,,,,,S,sols,,,48,6.083258,48.491107
2019-795525,2019-12-27,000001,Vente,174700,9,,RUE LA LOUVIERE RTE D'HOUDREVI,0061,54330,54247,Hammeville,54,,,542470000D0290,,,,,,,,,,,,,0,1,Maison,101,5,J,jardins,,,759,6.071763,48.499845
2019-795525,2019-12-27,000001,Vente,174700,9,,RUE LA LOUVIERE RTE D'HOUDREVI,0061,54330,54247,Hammeville,54,,,542470000D0290,,,,,,,,,,,,,0,1,Maison,101,5,S,sols,,,500,6.071763,48.499845
