id_mutation,date_mutation,numero_disposition,nature_mutation,valeur_fonciere,adresse_numero,adresse_suffixe,adresse_nom_voie,adresse_code_voie,code_postal,code_commune,nom_commune,code_departement,ancien_code_commune,ancien_nom_commune,id_parcelle,ancien_id_parcelle,numero_volume,lot1_numero,lot1_surface_carrez,lot2_numero,lot2_surface_carrez,lot3_numero,lot3_surface_carrez,lot4_numero,lot4_surface_carrez,lot5_numero,lot5_surface_carrez,nombre_lots,code_type_local,type_local,surface_reelle_bati,nombre_pieces_principales,code_nature_culture,nature_culture,code_nature_culture_speciale,nature_culture_speciale,surface_terrain,longitude,latitude
2019-786561,2019-01-23,000001,Vente,200500,6,,RUE THIERRY DE BAR,0045,54770,54289,Laître-sous-Amance,54,,,54289000AB0082,,,,,,,,,,,,,0,1,Maison,184,6,S,sols,,,315,6.277103,48.746622
2019-786561,2019-01-23,000001,Vente,200500,,,LE VILLAGE,B087,54770,54289,Laître-sous-Amance,54,,,54289000AB0354,,,,,,,,,,,,,0,,,,,P,prés,,,425,6.277201,48.746452
2019-786709,2019-01-30,000001,Vente,2000,,,AU HAUT DE LA CROIX,B043,54770,54289,Laître-sous-Amance,54,,,54289000AD0104,,,,,,,,,,,,,0,,,,,VE,vergers,,,460,6.27478,48.749807
2019-786709,2019-01-30,000001,Vente,2000,,,AU HAUT DE LA CROIX,B043,54770,54289,Laître-sous-Amance,54,,,54289000AD0287,,,,,,,,,,,,,0,,,,,VE,vergers,,,179,6.274552,48.749756
2019-787442,2019-02-27,000001,Vente,108650,2,,RUE SOPHIE DE BAR,0040,54770,54289,Laître-sous-Amance,54,,,54289000AB0249,,,,,,,,,,,,,0,1,Maison,72,3,S,sols,,,43,6.275194,48.746769
2019-788010,2019-03-29,000001,Vente,130000,17,,RUE CHARLES DE GAULLE,0025,54770,54289,Laître-sous-Amance,54,,,54289000AB0125,,,,,,,,,,,,,0,1,Maison,100,3,S,sols,,,390,6.276194,48.747781
2019-788261,2019-04-01,000001,Vente,280000,9001,,A MAURUPT,B055,54770,54289,Laître-sous-Amance,54,,,54289000ZD0055,,,,,,,,,,,,,0,1,Maison,90,5,S,sols,,,566,6.287819,48.741591
2019-788261,2019-04-01,000001,Vente,280000,9001,,A MAURUPT,B055,54770,54289,Laître-sous-Amance,54,,,54289000ZD0055,,,,,,,,,,,,,0,1,Maison,90,5,VE,vergers,,,1235,6.287819,48.741591
2019-788261,2019-04-01,000001,Vente,280000,9001,,A MAURUPT,B055,54770,54289,Laître-sous-Amance,54,,,54289000ZD0055,,,,,,,,,,,,,0,1,Maison,90,5,J,jardins,,,1003,6.287819,48.741591
2019-788636,2019-04-16,000001,Vente,97916.76,,,HARBA,B040,54770,54289,Laître-sous-Amance,54,,,542890000B0011,,,,,,,,,,,,,0,,,,,P,prés,,,8530,6.265299,48.725631
2019-788636,2019-04-16,000001,Vente,97916.76,,,HARBA,B040,54770,54289,Laître-sous-Amance,54,,,542890000B0013,,,,,,,,,,,,,0,,,,,P,prés,,,18900,6.26731,48.726255
2019-788843,2019-05-03,000001,Vente,3600,,,LES REINS SUD,B074,54770,54289,Laître-sous-Amance,54,,,54289000AB0179,,,,,,,,,,,,,0,,,,,VE,vergers,,,600,6.278823,48.748494
2019-788843,2019-05-03,000001,Vente,3600,,,LES REINS SUD,B074,54770,54289,Laître-sous-Amance,54,,,54289000AB0180,,,,,,,,,,,,,0,,,,,VE,vergers,,,495,6.279357,48.748548
2019-789057,2019-05-03,000001,Vente,75000,,,LE VILLAGE,B087,54770,54289,Laître-sous-Amance,54,,,54289000AB0265,,,,,,,,,,,,,0,,,,,J,jardins,,,655,,
2019-789057,2019-05-03,000001,Vente,75000,,,LE VILLAGE,B087,54770,54289,Laître-sous-Amance,54,,,54289000AB0266,,,,,,,,,,,,,0,,,,,J,jardins,,,655,,
2019-789144,2019-05-22,000001,Vente,1500,,,EN BRAHU,B009,54770,54289,Laître-sous-Amance,54,,,54289000AC0035,,,,,,,,,,,,,0,,,,,VE,vergers,,,2855,6.267422,48.747858
2019-793762,2019-11-19,000001,Vente,2000,,,LE BARBITON,B004,54770,54289,Laître-sous-Amance,54,,,54289000AC0218,,,,,,,,,,,,,0,,,,,P,prés,,,1025,6.269233,48.745753
2019-793762,2019-11-19,000001,Vente,2000,,,LE BARBITON,B004,54770,54289,Laître-sous-Amance,54,,,54289000AC0219,,,,,,,,,,,,,0,,,,,P,prés,,,2900,6.26925,48.745552
2019-793762,2019-11-19,000001,Vente,2000,,,LE BARBITON,B004,54770,54289,Laître-sous-Amance,54,,,54289000AC0220,,,,,,,,,,,,,0,,,,,VE,vergers,,,400,6.26864,48.745496
2019-794549,2019-12-04,000001,Vente,83400,,,LE VILLAGE,B087,54770,54289,Laître-sous-Amance,54,,,54289000AB0373,,,1,,,,,,,,,,1,3,Dépendance,,0,,,,,,6.273695,48.745632
2019-794549,2019-12-04,000001,Vente,83400,,,LE VILLAGE,B087,54770,54289,Laître-sous-Amance,54,,,54289000AB0373,,,3,107.5,,,,,,,,,1,2,Appartement,120,4,,,,,,6.273695,48.745632
2019-794549,2019-12-04,000001,Vente,83400,,,LE VILLAGE,B087,54770,54289,Laître-sous-Amance,54,,,54289000AB0373,,,8,,,,,,,,,,1,,,,,J,jardins,,,200,6.273695,48.745632
2019-795018,2019-12-23,000001,Vente,285000,,,DEVANT BOUTANGROGNE,B028,54770,54289,Laître-sous-Amance,54,,,54289000AC0488,,,,,,,,,,,,,0,,,,,VE,vergers,,,2555,6.273931,48.7513
2019-795018,2019-12-23,000001,Vente,285000,9001,,DEVANT BOUTANGROGNE,B028,54770,54289,Laître-sous-Amance,54,,,54289000AC0489,,,,,,,,,,,,,0,1,Maison,230,6,S,sols,,,786,6.274233,48.751537
