id_mutation,date_mutation,numero_disposition,nature_mutation,valeur_fonciere,adresse_numero,adresse_suffixe,adresse_nom_voie,adresse_code_voie,code_postal,code_commune,nom_commune,code_departement,ancien_code_commune,ancien_nom_commune,id_parcelle,ancien_id_parcelle,numero_volume,lot1_numero,lot1_surface_carrez,lot2_numero,lot2_surface_carrez,lot3_numero,lot3_surface_carrez,lot4_numero,lot4_surface_carrez,lot5_numero,lot5_surface_carrez,nombre_lots,code_type_local,type_local,surface_reelle_bati,nombre_pieces_principales,code_nature_culture,nature_culture,code_nature_culture_speciale,nature_culture_speciale,surface_terrain,longitude,latitude
2019-786570,2019-01-28,000001,Vente,236500,1,,CHEM DES VIGNES,0070,54740,54299,Laneuveville-devant-Bayon,54,,,54299000AA0247,,,,,,,,,,,,,0,1,Maison,114,4,S,sols,,,800,6.26652,48.472928
2019-788176,2019-04-05,000001,Vente,80000,11,,RUE DE NEUVILLER,0047,54740,54299,Laneuveville-devant-Bayon,54,,,54299000AA0106,,,,,,,,,,,,,0,1,Maison,103,4,S,sols,,,223,6.266475,48.471465
2019-788176,2019-04-05,000001,Vente,80000,13,,RUE DE NEUVILLER,0047,54740,54299,Laneuveville-devant-Bayon,54,,,54299000AA0107,,,,,,,,,,,,,0,3,Dépendance,,0,S,sols,,,149,6.266382,48.471547
2019-788792,2019-04-24,000001,Vente,195500,39,,RUE DE NEUVILLER,0047,54740,54299,Laneuveville-devant-Bayon,54,,,54299000AA0256,,,,,,,,,,,,,0,1,Maison,130,5,S,sols,,,941,6.265415,48.473627
2019-789084,2019-05-21,000001,Vente,204900,21,,RUE DE NEUVILLER,0047,54740,54299,Laneuveville-devant-Bayon,54,,,54299000AA0221,,,,,,,,,,,,,0,1,Maison,101,4,J,jardins,,,500,6.265473,48.472188
2019-789084,2019-05-21,000001,Vente,204900,21,,RUE DE NEUVILLER,0047,54740,54299,Laneuveville-devant-Bayon,54,,,54299000AA0221,,,,,,,,,,,,,0,1,Maison,101,4,S,sols,,,373,6.265473,48.472188
2019-789084,2019-05-21,000001,Vente,204900,21,,RUE DE NEUVILLER,0047,54740,54299,Laneuveville-devant-Bayon,54,,,54299000AA0221,,,,,,,,,,,,,0,1,Maison,101,4,VE,vergers,,,787,6.265473,48.472188
2019-789244,2019-05-31,000001,Vente,3261.9,,,LE HAUT DE L ETANG,B041,54740,54299,Laneuveville-devant-Bayon,54,,,542990000C0442,,,,,,,,,,,,,0,,,,,BT,taillis simples,,,2540,6.278495,48.472739
2019-789988,2019-06-24,000001,Vente,1,,,LA MAIX LA VAUTE,B048,54740,54299,Laneuveville-devant-Bayon,54,,,54299000ZH0052,,,,,,,,,,,,,0,4,Local industriel. commercial ou assimilé,1853,0,P,prés,,,41855,6.257616,48.469735
2019-789988,2019-06-24,000001,Vente,1,,,LA MAIX LA VAUTE,B048,54740,54299,Laneuveville-devant-Bayon,54,,,54299000ZH0052,,,,,,,,,,,,,0,4,Local industriel. commercial ou assimilé,1853,0,S,sols,,,10000,6.257616,48.469735
2019-789988,2019-06-24,000001,Vente,1,,,LA MAIX LA VAUTE,B048,54740,54299,Laneuveville-devant-Bayon,54,,,54299000ZH0052,,,,,,,,,,,,,0,4,Local industriel. commercial ou assimilé,284,0,P,prés,,,41855,6.257616,48.469735
2019-789988,2019-06-24,000001,Vente,1,,,LA MAIX LA VAUTE,B048,54740,54299,Laneuveville-devant-Bayon,54,,,54299000ZH0052,,,,,,,,,,,,,0,4,Local industriel. commercial ou assimilé,284,0,S,sols,,,10000,6.257616,48.469735
2019-790143,2019-06-18,000001,Vente,4965,,,AUX MAIX BLES,B045,54740,54299,Laneuveville-devant-Bayon,54,,,54299000AA0026,,,,,,,,,,,,,0,,,,,VE,vergers,,,474,6.269374,48.470319
2019-790143,2019-06-18,000001,Vente,4965,,,SUR RLE ROUILLE CHEM BAINU,B069,54740,54299,Laneuveville-devant-Bayon,54,,,54299000AA0037,,,,,,,,,,,,,0,,,,,T,terres,,,1460,6.269014,48.469147
2019-790143,2019-06-18,000001,Vente,4965,,,LES MONGEOITES,B052,54740,54299,Laneuveville-devant-Bayon,54,,,542990000C0474,,,,,,,,,,,,,0,,,,,BT,taillis simples,,,960,6.280347,48.475066
2019-790143,2019-06-18,000001,Vente,4965,,,AU GRIS BOIS,B037,54740,54299,Laneuveville-devant-Bayon,54,,,54299000ZC0017,,,,,,,,,,,,,0,,,,,P,prés,,,5397,6.263978,48.468849
2019-790143,2019-06-18,000001,Vente,4965,,,AU GRIS BOIS,B037,54740,54299,Laneuveville-devant-Bayon,54,,,54299000ZC0017,,,,,,,,,,,,,0,,,,,P,prés,,,5397,6.263978,48.468849
2019-790143,2019-06-18,000001,Vente,4965,,,AU GRIS BOIS,B037,54740,54299,Laneuveville-devant-Bayon,54,,,54299000ZC0017,,,,,,,,,,,,,0,,,,,P,prés,,,5396,6.263978,48.468849
2019-790143,2019-06-18,000001,Vente,4965,,,AU GRIS BOIS,B037,54740,54299,Laneuveville-devant-Bayon,54,,,54299000ZC0020,,,,,,,,,,,,,0,,,,,P,prés,,,1490,6.263981,48.469458
2019-790143,2019-06-18,000001,Vente,4965,,,AU REBERTRAND,B068,54740,54299,Laneuveville-devant-Bayon,54,,,54299000ZC0052,,,,,,,,,,,,,0,,,,,VE,vergers,,,64,6.269374,48.470201
2019-791458,2019-08-09,000001,Vente,125000,2,,VC LES RUELLES,0055,54740,54299,Laneuveville-devant-Bayon,54,,,54299000AA0062,,,,,,,,,,,,,0,1,Maison,122,6,S,sols,,,673,6.2669,48.469709
2019-792740,2019-09-30,000001,Vente,52978.7,,,A FOURCHU SUR LE PUISOT,B027,54740,54299,Laneuveville-devant-Bayon,54,,,54299000ZA0019,,,,,,,,,,,,,0,,,,,L,landes,FRICH,Friche,4822,6.263172,48.482316
2019-792740,2019-09-30,000001,Vente,52978.7,,,A FOURCHU SUR LE PUISOT,B027,54740,54299,Laneuveville-devant-Bayon,54,,,54299000ZA0019,,,,,,,,,,,,,0,,,,,BT,taillis simples,,,9644,6.263172,48.482316
2019-792740,2019-09-30,000001,Vente,52978.7,,,LA CHATTE,B010,54740,54299,Laneuveville-devant-Bayon,54,,,54299000ZC0102,,,,,,,,,,,,,0,,,,,P,prés,,,9066,6.265398,48.463211
2019-792740,2019-09-30,000001,Vente,52978.7,,,LA CHATTE,B010,54740,54299,Laneuveville-devant-Bayon,54,,,54299000ZC0102,,,,,,,,,,,,,0,,,,,L,landes,FRICH,Friche,9065,6.265398,48.463211
2019-793379,2019-10-07,000001,Vente,51084.11,,,LE PATIS DU PUISOT,B060,54740,54299,Laneuveville-devant-Bayon,54,,,54299000ZB0058,,,,,,,,,,,,,0,,,,,P,prés,,,50000,6.264097,48.478975
2019-793379,2019-10-07,000001,Vente,51084.11,,,LE PATIS DU PUISOT,B060,54740,54299,Laneuveville-devant-Bayon,54,,,54299000ZB0058,,,,,,,,,,,,,0,,,,,P,prés,,,48531,6.264097,48.478975
2019-793379,2019-10-07,000001,Vente,51084.11,,,LE PATIS DU PUISOT,B060,54740,54299,Laneuveville-devant-Bayon,54,,,54299000ZB0061,,,,,,,,,,,,,0,,,,,P,prés,,,39272,6.272155,48.476881
2019-793542,2019-11-04,000001,Vente,820.36,,,DERRIERE LA TOUR,B019,54740,54299,Laneuveville-devant-Bayon,54,,,54299000AA0040,,,,,,,,,,,,,0,,,,,VE,vergers,,,368,6.267669,48.469293
2019-793542,2019-11-04,000001,Vente,820.36,,,LES BLANCHES VIGNES,B001,54740,54299,Laneuveville-devant-Bayon,54,,,542990000C0293,,,,,,,,,,,,,0,,,,,P,prés,,,980,6.270348,48.473047
2019-793965,2019-11-19,000001,Vente,150,,,LE HAUT DE L ETANG,B041,54740,54299,Laneuveville-devant-Bayon,54,,,542990000C0468,,,,,,,,,,,,,0,,,,,BT,taillis simples,,,520,6.279141,48.474253
2019-793965,2019-11-19,000001,Vente,150,,,A L ETANG,B025,54740,54299,Laneuveville-devant-Bayon,54,,,542990000C0605,,,,,,,,,,,,,0,,,,,BT,taillis simples,,,183,6.278174,48.471492
2019-793965,2019-11-19,000001,Vente,150,,,A GOLINVEAU,B033,54740,54299,Laneuveville-devant-Bayon,54,,,54299000ZB0017,,,,,,,,,,,,,0,,,,,BT,taillis simples,,,645,6.275849,48.474511
2019-793998,2019-11-20,000001,Vente,10707.8,,,RUE DE BAINVILLE,0006,54740,54299,Laneuveville-devant-Bayon,54,,,54299000AA0036,,,,,,,,,,,,,0,,,,,T,terres,,,868,6.268765,48.469258
2019-793998,2019-11-20,000001,Vente,10707.8,,,LES GRANDES CHENEVIERES,B036,54740,54299,Laneuveville-devant-Bayon,54,,,54299000AA0054,,,,,,,,,,,,,0,,,,,VE,vergers,,,198,6.266847,48.468774
2019-793998,2019-11-20,000001,Vente,10707.8,,,LES GRANDES CHENEVIERES,B036,54740,54299,Laneuveville-devant-Bayon,54,,,54299000AA0054,,,,,,,,,,,,,0,,,,,T,terres,,,930,6.266847,48.468774
2019-793998,2019-11-20,000001,Vente,10707.8,,,A FOURCHU SUR L EPINGLETTE,B026,54740,54299,Laneuveville-devant-Bayon,54,,,54299000ZA0004,,,,,,,,,,,,,0,,,,,T,terres,,,2808,6.251826,48.480741
2019-793998,2019-11-20,000001,Vente,10707.8,,,A FOURCHU SUR L EPINGLETTE,B026,54740,54299,Laneuveville-devant-Bayon,54,,,54299000ZA0004,,,,,,,,,,,,,0,,,,,T,terres,,,8425,6.251826,48.480741
2019-793998,2019-11-20,000001,Vente,10707.8,,,AU GRIS BOIS,B037,54740,54299,Laneuveville-devant-Bayon,54,,,54299000ZC0006,,,,,,,,,,,,,0,,,,,P,prés,,,7523,6.260139,48.466169
2019-793998,2019-11-20,000001,Vente,10707.8,,,AU GRIS BOIS,B037,54740,54299,Laneuveville-devant-Bayon,54,,,54299000ZC0006,,,,,,,,,,,,,0,,,,,P,prés,,,3762,6.260139,48.466169
2019-794295,2019-12-03,000001,Vente,13000,,,LE VILLAGE,B074,54740,54299,Laneuveville-devant-Bayon,54,,,54299000AA0270,,,,,,,,,,,,,0,,,,,S,sols,,,8,6.265639,48.471084
2019-794295,2019-12-03,000001,Vente,13000,,,LE VILLAGE,B074,54740,54299,Laneuveville-devant-Bayon,54,,,54299000AA0271,,,,,,,,,,,,,0,,,,,S,sols,,,245,6.265753,48.471019
2019-794531,2019-11-29,000001,Vente,38777.19,,,LE PATIS DU PUISOT,B060,54740,54299,Laneuveville-devant-Bayon,54,,,54299000ZB0059,,,,,,,,,,,,,0,,,,,P,prés,,,71991,6.266423,48.479753
2019-794531,2019-11-29,000001,Vente,38777.19,,,LES CHAMPS LE SAULNIER,B008,54740,54299,Laneuveville-devant-Bayon,54,,,54299000ZE0021,,,,,,,,,,,,,0,,,,,P,prés,,,30000,6.259264,48.460348
2019-794531,2019-11-29,000001,Vente,38777.19,,,LES CHAMPS LE SAULNIER,B008,54740,54299,Laneuveville-devant-Bayon,54,,,54299000ZE0021,,,,,,,,,,,,,0,,,,,L,landes,FRICH,Friche,6804,6.259264,48.460348
2019-795249,2019-12-26,000001,Vente,1250,,,SUR BREAU,B004,54740,54299,Laneuveville-devant-Bayon,54,,,542990000C0345,,,,,,,,,,,,,0,,,,,P,prés,,,920,6.273183,48.47218
2019-795491,2019-12-26,000001,Vente,4000,,,SUR BREAU,B004,54740,54299,Laneuveville-devant-Bayon,54,,,542990000C0365,,,,,,,,,,,,,0,,,,,VE,vergers,,,660,6.269328,48.472238
2019-795491,2019-12-26,000001,Vente,4000,,,SUR BREAU,B004,54740,54299,Laneuveville-devant-Bayon,54,,,542990000C0366,,,,,,,,,,,,,0,,,,,VE,vergers,,,244,6.268888,48.472089
2019-795491,2019-12-26,000001,Vente,4000,,,SUR BREAU,B004,54740,54299,Laneuveville-devant-Bayon,54,,,542990000C0366,,,,,,,,,,,,,0,,,,,S,sols,,,96,6.268888,48.472089
2019-795551,2019-12-30,000001,Vente,68300,,,LE HAUT DE CHIRMONT,B040,54740,54299,Laneuveville-devant-Bayon,54,,,54299000ZE0030,,,,,,,,,,,,,0,,,,,P,prés,,,3729,6.255653,48.468205
2019-795551,2019-12-30,000001,Vente,68300,,,LE HAUT DE CHIRMONT,B040,54740,54299,Laneuveville-devant-Bayon,54,,,54299000ZE0032,,,,,,,,,,,,,0,,,,,P,prés,,,7287,6.254918,48.467571
