id_mutation,date_mutation,numero_disposition,nature_mutation,valeur_fonciere,adresse_numero,adresse_suffixe,adresse_nom_voie,adresse_code_voie,code_postal,code_commune,nom_commune,code_departement,ancien_code_commune,ancien_nom_commune,id_parcelle,ancien_id_parcelle,numero_volume,lot1_numero,lot1_surface_carrez,lot2_numero,lot2_surface_carrez,lot3_numero,lot3_surface_carrez,lot4_numero,lot4_surface_carrez,lot5_numero,lot5_surface_carrez,nombre_lots,code_type_local,type_local,surface_reelle_bati,nombre_pieces_principales,code_nature_culture,nature_culture,code_nature_culture_speciale,nature_culture_speciale,surface_terrain,longitude,latitude
2019-795729,2019-01-14,000001,Vente,305000,,,LES HUIT JOURNAUX,B034,54580,54371,Moineville,54,,,54371000ZC0281,,,,,,,,,,,,,0,,,,,L,landes,,,550,5.950361,49.205743
2019-795729,2019-01-14,000001,Vente,305000,15,,RUE PASTEUR,0180,54580,54371,Moineville,54,,,54371000ZC0350,,,,,,,,,,,,,0,1,Maison,140,5,S,sols,,,500,5.950277,49.205507
2019-795729,2019-01-14,000001,Vente,305000,15,,RUE PASTEUR,0180,54580,54371,Moineville,54,,,54371000ZC0350,,,,,,,,,,,,,0,1,Maison,140,5,J,jardins,,,500,5.950277,49.205507
2019-795729,2019-01-14,000001,Vente,305000,15,,RUE PASTEUR,0180,54580,54371,Moineville,54,,,54371000ZC0350,,,,,,,,,,,,,0,1,Maison,140,5,T,terres,,,798,5.950277,49.205507
2019-796236,2019-02-26,000001,Vente,1500,,,LE CHENOIS,B010,54580,54371,Moineville,54,,,54371000ZC0037,,,,,,,,,,,,,0,,,,,T,terres,,,2190,5.950472,49.202642
2019-796583,2019-04-24,000001,Vente,12000,5138,F,MINE DU PARADIS,B037,54580,54371,Moineville,54,,,543710000X0138,,,,,,,,,,,,,0,4,Local industriel. commercial ou assimilé,85,0,S,sols,,,684,5.961503,49.190326
2019-796651,2019-05-03,000001,Vente,137950,7,,RUE PASTEUR,0180,54580,54371,Moineville,54,,,54371000AB0087,,,,,,,,,,,,,0,1,Maison,86,4,S,sols,,,465,5.946451,49.206908
2019-796839,2019-04-29,000001,Vente,127000,6,,RUE DE LA MINE,0124,54580,54371,Moineville,54,,,543710000X0122,,,3,76.5,,,,,,,,,1,2,Appartement,74,3,,,,,,5.962258,49.191509
2019-796839,2019-04-29,000001,Vente,127000,6,,RUE DE LA MINE,0124,54580,54371,Moineville,54,,,543710000X0122,,,5,,,,,,,,,,1,3,Dépendance,,0,,,,,,5.962258,49.191509
2019-797132,2019-06-01,000001,Vente,155000,5062,,RUE PASTEUR,0180,54580,54371,Moineville,54,,,54371000AB0062,,,,,,,,,,,,,0,3,Dépendance,,0,S,sols,,,196,5.945707,49.206585
2019-797132,2019-06-01,000001,Vente,155000,15,,PL DE LA LIBERATION,0100,54580,54371,Moineville,54,,,54371000AB0063,,,,,,,,,,,,,0,,,,,S,sols,,,223,5.945588,49.206627
2019-797132,2019-06-01,000001,Vente,155000,12,,RUE PASTEUR,0180,54580,54371,Moineville,54,,,54371000AB0064,,,,,,,,,,,,,0,4,Local industriel. commercial ou assimilé,80,0,S,sols,,,110,5.945668,49.206681
2019-797132,2019-06-01,000001,Vente,155000,12,,RUE PASTEUR,0180,54580,54371,Moineville,54,,,54371000AB0064,,,,,,,,,,,,,0,1,Maison,100,4,S,sols,,,110,5.945668,49.206681
2019-797240,2019-07-03,000001,Vente,50160,,,LE KINCHAMP,B035,54580,54371,Moineville,54,,,54371000ZC0362,,,,,,,,,,,,,0,,,,,P,prés,,,456,5.947278,49.207154
2019-797478,2019-07-26,000001,Vente,297500,5009,,SAUVIGNON,B048,54580,54371,Moineville,54,,,54371000AB0009,,,,,,,,,,,,,0,1,Maison,125,4,J,jardins,,,500,5.941972,49.205783
2019-797478,2019-07-26,000001,Vente,297500,5009,,SAUVIGNON,B048,54580,54371,Moineville,54,,,54371000AB0009,,,,,,,,,,,,,0,1,Maison,125,4,S,sols,,,500,5.941972,49.205783
2019-797478,2019-07-26,000001,Vente,297500,5009,,SAUVIGNON,B048,54580,54371,Moineville,54,,,54371000AB0009,,,,,,,,,,,,,0,1,Maison,125,4,P,prés,,,1413,5.941972,49.205783
2019-797630,2019-08-14,000001,Vente,27060,,,LE KINCHAMP,B035,54580,54371,Moineville,54,,,54371000ZC0356,,,,,,,,,,,,,0,,,,,P,prés,,,246,5.947729,49.206691
2019-797632,2019-08-06,000001,Vente,31130,,,LE KINCHAMP,B035,54580,54371,Moineville,54,,,54371000ZC0361,,,,,,,,,,,,,0,,,,,P,prés,,,283,5.947412,49.20707
2019-797681,2019-07-27,000001,Vente,146230,12,,RUE DE L ENCLOS,0050,54580,54371,Moineville,54,,,54371000AB0218,,,,,,,,,,,,,0,1,Maison,139,6,S,sols,,,524,5.945238,49.204601
2019-797949,2019-09-13,000001,Vente,27500,,,LE KINCHAMP,B035,54580,54371,Moineville,54,,,54371000ZC0355,,,,,,,,,,,,,0,,,,,P,prés,,,250,5.947754,49.206623
2019-797966,2019-09-16,000001,Vente,12000,9002,,AV DE LA REPUBLIQUE,0200,54580,54371,Moineville,54,,,54371000AB0157,,,,,,,,,,,,,0,3,Dépendance,,0,S,sols,,,84,5.945288,49.204764
2019-797966,2019-09-16,000001,Vente,12000,,,L ENCLOS,B020,54580,54371,Moineville,54,,,54371000AB0257,,,,,,,,,,,,,0,,,,,S,sols,,,85,5.945224,49.204825
2019-797973,2019-09-20,000001,Vente,301625,6,,LOT LES HUIT JOURNAUX,A030,54580,54371,Moineville,54,,,54371000ZC0264,,,,,,,,,,,,,0,1,Maison,122,5,S,sols,,,500,5.951386,49.204763
2019-797973,2019-09-20,000001,Vente,301625,6,,LOT LES HUIT JOURNAUX,A030,54580,54371,Moineville,54,,,54371000ZC0264,,,,,,,,,,,,,0,1,Maison,122,5,J,jardins,,,576,5.951386,49.204763
2019-798048,2019-09-24,000001,Vente,48510,,,LE KINCHAMP,B035,54580,54371,Moineville,54,,,54371000ZC0360,,,,,,,,,,,,,0,,,,,P,prés,,,441,5.947482,49.20695
2019-798298,2019-10-08,000001,Vente,15000,,,BOULEAU,B005,54580,54371,Moineville,54,,,54371000ZA0096,,,,,,,,,,,,,0,,,,,J,jardins,,,742,5.927048,49.196415
2019-798324,2019-10-21,000001,Vente,72000,59,,RUE DE LA ROCHE,0220,54580,54371,Moineville,54,,,54371000AC0152,,,,,,,,,,,,,0,1,Maison,80,5,S,sols,,,299,5.942587,49.204998
2019-798412,2019-10-28,000001,Vente,26730,,,LE KINCHAMP,B035,54580,54371,Moineville,54,,,54371000ZC0357,,,,,,,,,,,,,0,,,,,P,prés,,,243,5.947676,49.206754
2019-798540,2019-11-13,000001,Vente,4000,9003,,RUE CAMILLE CAVALLIER,0003,54580,54371,Moineville,54,,,543710000X0152,,,,,,,,,,,,,0,3,Dépendance,,0,S,sols,,,21,5.963487,49.190601
2019-798552,2019-11-18,000001,Vente,277500,15,,LOT LE CLOS DU MOULIN,A025,54580,54371,Moineville,54,,,54371000ZA0135,,,,,,,,,,,,,0,1,Maison,156,5,S,sols,,,595,5.936655,49.201331
2019-798618,2019-11-20,000001,Vente,89880,,,LE KINCHAMP,B035,54580,54371,Moineville,54,,,54371000ZC0386,,,,,,,,,,,,,0,,,,,P,prés,,,749,5.948437,49.208178
2019-798735,2019-12-04,000001,Vente terrain à bâtir,66840,,,LE KINCHAMP,B035,54580,54371,Moineville,54,,,54371000ZC0374,,,,,,,,,,,,,0,,,,,P,prés,,,557,5.949116,49.207114
2019-798977,2019-12-16,000001,Vente,73200,,,LE KINCHAMP,B035,54580,54371,Moineville,54,,,54371000ZC0375,,,,,,,,,,,,,0,,,,,P,prés,,,610,5.948935,49.207251
2019-799113,2019-12-23,000001,Vente,216200,14,,LOT LES HUIT JOURNAUX,A030,54580,54371,Moineville,54,,,54371000ZC0258,,,,,,,,,,,,,0,1,Maison,100,5,J,jardins,,,200,5.951892,49.20536
2019-799113,2019-12-23,000001,Vente,216200,14,,LOT LES HUIT JOURNAUX,A030,54580,54371,Moineville,54,,,54371000ZC0258,,,,,,,,,,,,,0,1,Maison,100,5,S,sols,,,500,5.951892,49.20536
