id_mutation,date_mutation,numero_disposition,nature_mutation,valeur_fonciere,adresse_numero,adresse_suffixe,adresse_nom_voie,adresse_code_voie,code_postal,code_commune,nom_commune,code_departement,ancien_code_commune,ancien_nom_commune,id_parcelle,ancien_id_parcelle,numero_volume,lot1_numero,lot1_surface_carrez,lot2_numero,lot2_surface_carrez,lot3_numero,lot3_surface_carrez,lot4_numero,lot4_surface_carrez,lot5_numero,lot5_surface_carrez,nombre_lots,code_type_local,type_local,surface_reelle_bati,nombre_pieces_principales,code_nature_culture,nature_culture,code_nature_culture_speciale,nature_culture_speciale,surface_terrain,longitude,latitude
2019-787542,2019-02-25,000001,Vente,5500,,,ABOUTISSANT SUR CHP D AULN,B003,54760,54372,Moivrons,54,,,543720000A0136,,,,,,,,,,,,,0,,,,,P,prés,,,1360,6.258724,48.827689
2019-787542,2019-02-25,000001,Vente,5500,,,CHAMP D AULNOIS,B013,54760,54372,Moivrons,54,,,543720000A0453,,,,,,,,,,,,,0,,,,,T,terres,,,1553,6.257324,48.826009
2019-787542,2019-02-25,000001,Vente,5500,,,EN FONTENY,B047,54760,54372,Moivrons,54,,,543720000D0022,,,,,,,,,,,,,0,,,,,T,terres,,,425,6.249717,48.827784
2019-787542,2019-02-25,000001,Vente,5500,,,AU CLOS,B023,54760,54372,Moivrons,54,,,543720000D0494,,,,,,,,,,,,,0,,,,,T,terres,,,233,6.245105,48.828077
2019-787542,2019-02-25,000001,Vente,5500,,,LE CHAMBREY,B012,54760,54372,Moivrons,54,,,543720000D0585,,,,,,,,,,,,,0,,,,,VE,vergers,,,493,6.243328,48.824513
2019-787542,2019-02-25,000001,Vente,5500,,,LE CHAMBREY,B012,54760,54372,Moivrons,54,,,543720000D0591,,,,,,,,,,,,,0,,,,,VE,vergers,,,600,6.243446,48.824607
2019-787542,2019-02-25,000001,Vente,5500,,,SUR LA CLAUSSE,B021,54760,54372,Moivrons,54,,,543720000D0945,,,,,,,,,,,,,0,,,,,T,terres,,,1440,6.256254,48.822997
2019-787542,2019-02-25,000001,Vente,5500,,,EN ROUELLE,B093,54760,54372,Moivrons,54,,,543720000D1038,,,,,,,,,,,,,0,,,,,VE,vergers,,,280,6.242779,48.823441
2019-787672,2019-03-01,000001,Vente,13000,33,,RUE DE LA GARE,0100,54760,54372,Moivrons,54,,,543720000D0831,,,,,,,,,,,,,0,1,Maison,93,2,S,sols,,,160,6.248233,48.823358
2019-788360,2019-04-05,000001,Vente,2000,,,DANS LE HAUT,B030,54760,54372,Moivrons,54,,,543720000C0252,,,,,,,,,,,,,0,,,,,VE,vergers,,,330,6.2402,48.827732
2019-788360,2019-04-05,000001,Vente,2000,,,REHAME,B091,54760,54372,Moivrons,54,,,543720000D0075,,,,,,,,,,,,,0,,,,,P,prés,,,653,6.250902,48.827901
2019-788360,2019-04-05,000001,Vente,2000,,,DERRIERE LA COUR,B031,54760,54372,Moivrons,54,,,543720000D0442,,,,,,,,,,,,,0,,,,,VE,vergers,,,430,6.24492,48.826388
2019-788360,2019-04-05,000001,Vente,2000,,,DERRIERE LA COUR,B031,54760,54372,Moivrons,54,,,543720000D0445,,,,,,,,,,,,,0,,,,,VE,vergers,,,196,6.244739,48.826433
2019-788360,2019-04-05,000001,Vente,2000,,,DERRIERE LA COUR,B031,54760,54372,Moivrons,54,,,543720000D0446,,,,,,,,,,,,,0,,,,,VE,vergers,,,220,6.244684,48.82628
2019-788360,2019-04-05,000001,Vente,2000,,,AU CLOS,B023,54760,54372,Moivrons,54,,,543720000D0498,,,,,,,,,,,,,0,,,,,VI,vignes,,,422,6.245668,48.827277
2019-788377,2019-04-04,000001,Vente,286,,,SOUS LE CLOS,B098,54760,54372,Moivrons,54,,,543720000D0395,,,,,,,,,,,,,0,,,,,VE,vergers,,,286,6.246941,48.826744
2019-788421,2019-04-23,000001,Vente,59000,30,,GR GRAND RUE,0199,54760,54372,Moivrons,54,,,543720000D0741,,,,,,,,,,,,,0,1,Maison,137,3,S,sols,,,625,6.248676,48.822632
2019-788587,2019-04-26,000001,Vente,230000,,,LE VILLAGE,B112,54760,54372,Moivrons,54,,,543720000D1403,,,,,,,,,,,,,0,,,,,P,prés,,,74,6.248726,48.820546
2019-788587,2019-04-26,000001,Vente,230000,1,C,RUE DE VILLERS,0220,54760,54372,Moivrons,54,,,543720000D1425,,,,,,,,,,,,,0,1,Maison,110,6,S,sols,,,902,6.247816,48.820411
2019-788587,2019-04-26,000001,Vente,230000,,,LE VILLAGE,B112,54760,54372,Moivrons,54,,,543720000D1427,,,,,,,,,,,,,0,,,,,J,jardins,,,193,6.248343,48.820463
2019-789168,2019-05-15,000001,Vente,205770,5,T,RUE DE VILLERS,0220,54760,54372,Moivrons,54,,,543720000D1363,,,,,,,,,,,,,0,1,Maison,115,5,S,sols,,,466,6.247445,48.821411
2019-789168,2019-05-15,000001,Vente,205770,,,LE VILLAGE,B112,54760,54372,Moivrons,54,,,543720000D1364,,,,,,,,,,,,,0,,,,,S,sols,,,17,6.247309,48.821398
2019-789168,2019-05-15,000001,Vente,205770,,,LE VILLAGE,B112,54760,54372,Moivrons,54,,,543720000D1371,,,,,,,,,,,,,0,,,,,S,sols,,,240,6.247476,48.821251
2019-789168,2019-05-15,000001,Vente,205770,5,,RUE DE VILLERS,0220,54760,54372,Moivrons,54,,,54372000XA0113,,,,,,,,,,,,,0,,,,,S,sols,,,80,6.247308,48.821554
2019-789210,2019-05-22,000001,Vente,400,,,TRAVERS DU BAS DE XE,B106,54760,54372,Moivrons,54,,,543720000B0198,,,,,,,,,,,,,0,,,,,VE,vergers,,,605,6.236233,48.821876
2019-789210,2019-05-22,000001,Vente,400,,,TRAVERS DU BAS DE XE,B106,54760,54372,Moivrons,54,,,543720000B0202,,,,,,,,,,,,,0,,,,,VE,vergers,,,667,6.23649,48.820756
2019-790631,2019-07-19,000001,Vente,3157,,,PETITE FROIDE TERRE,B079,54760,54372,Moivrons,54,,,543720000C0009,,,,,,,,,,,,,0,,,,,BT,taillis simples,,,1300,6.243495,48.834739
2019-790631,2019-07-19,000001,Vente,3157,,,LA GOULOTTE,B053,54760,54372,Moivrons,54,,,543720000C0069,,,,,,,,,,,,,0,,,,,BT,taillis simples,,,1570,6.247946,48.83483
2019-791135,2019-07-23,000001,Vente,233000,,,CHAMP D AULNOIS,B013,54760,54372,Moivrons,54,,,543720000A0443,,,,,,,,,,,,,0,,,,,P,prés,,,8045,6.259083,48.826235
2019-791135,2019-07-23,000001,Vente,233000,,,CHAMP D AULNOIS,B013,54760,54372,Moivrons,54,,,543720000A0446,,,,,,,,,,,,,0,,,,,P,prés,,,2377,6.258243,48.826917
2019-791135,2019-07-23,000001,Vente,233000,,,CHAMP D AULNOIS,B013,54760,54372,Moivrons,54,,,543720000A0459,,,,,,,,,,,,,0,,,,,S,sols,,,634,6.258561,48.825212
2019-791135,2019-07-23,000001,Vente,233000,,,CHAMP D AULNOIS,B013,54760,54372,Moivrons,54,,,543720000A0459,,,,,,,,,,,,,0,,,,,VE,vergers,,,600,6.258561,48.825212
2019-791135,2019-07-23,000001,Vente,233000,5001,,CHAMP D AULNOIS,B013,54760,54372,Moivrons,54,,,543720000A0593,,,,,,,,,,,,,0,4,Local industriel. commercial ou assimilé,65,0,P,prés,,,3301,6.258976,48.825121
2019-791135,2019-07-23,000001,Vente,233000,5001,,CHAMP D AULNOIS,B013,54760,54372,Moivrons,54,,,543720000A0593,,,,,,,,,,,,,0,4,Local industriel. commercial ou assimilé,885,0,S,sols,,,510,6.258976,48.825121
2019-791135,2019-07-23,000001,Vente,233000,5001,,CHAMP D AULNOIS,B013,54760,54372,Moivrons,54,,,543720000A0593,,,,,,,,,,,,,0,4,Local industriel. commercial ou assimilé,65,0,S,sols,,,510,6.258976,48.825121
2019-791135,2019-07-23,000001,Vente,233000,5001,,CHAMP D AULNOIS,B013,54760,54372,Moivrons,54,,,543720000A0593,,,,,,,,,,,,,0,4,Local industriel. commercial ou assimilé,885,0,P,prés,,,3301,6.258976,48.825121
2019-792037,2019-09-05,000001,Vente,80000,6,,RUE DE LA COTE,0030,54760,54372,Moivrons,54,,,54372000XA0025,,,,,,,,,,,,,0,1,Maison,154,7,S,sols,,,395,6.248901,48.8237
2019-792088,2019-09-03,000001,Vente,176000,6,E,GR GRAND RUE,0199,54760,54372,Moivrons,54,,,543720000D1231,,,,,,,,,,,,,0,1,Maison,90,4,S,sols,,,432,6.25474,48.824028
2019-792088,2019-09-03,000001,Vente,176000,6,E,GR GRAND RUE,0199,54760,54372,Moivrons,54,,,543720000D1231,,,,,,,,,,,,,0,1,Maison,90,4,J,jardins,,,739,6.25474,48.824028
2019-792728,2019-10-01,000001,Vente,500,,,AU CLOS,B023,54760,54372,Moivrons,54,,,543720000D1085,,,,,,,,,,,,,0,,,,,VE,vergers,,,378,6.246566,48.827118
2019-792737,2019-10-04,000001,Vente,230500,39,,RUE DE LA GARE,0100,54760,54372,Moivrons,54,,,543720000D0683,,,,,,,,,,,,,0,1,Maison,80,3,S,sols,,,363,6.245845,48.823063
2019-792737,2019-10-04,000001,Vente,230500,,,LE VILLAGE,B112,54760,54372,Moivrons,54,,,543720000D0684,,,,,,,,,,,,,0,,,,,J,jardins,,,598,6.245884,48.822944
2019-792737,2019-10-04,000001,Vente,230500,,,LE VILLAGE,B112,54760,54372,Moivrons,54,,,543720000D1163,,,,,,,,,,,,,0,,,,,S,sols,,,78,6.245792,48.823171
2019-793462,2019-10-28,000001,Vente,300,,,TRAVERS DU BAS DE XE,B106,54760,54372,Moivrons,54,,,543720000B0195,,,,,,,,,,,,,0,,,,,P,prés,,,560,6.235523,48.821954
2019-793470,2019-10-18,000001,Vente,169950,8,H,GR GRAND RUE,0199,54760,54372,Moivrons,54,,,543720000D1313,,,,,,,,,,,,,0,1,Maison,88,4,S,sols,,,1176,6.252559,48.823369
2019-794935,2019-12-10,000001,Vente,12000,,,LE CLOS PRE,B024,54760,54372,Moivrons,54,,,543720000A0216,,,,,,,,,,,,,0,,,,,P,prés,,,1230,6.264835,48.825585
2019-794935,2019-12-10,000001,Vente,12000,,,DEVANT LE JURY BOIS,B037,54760,54372,Moivrons,54,,,543720000A0519,,,,,,,,,,,,,0,,,,,T,terres,,,1825,6.252206,48.830515
2019-794935,2019-12-10,000001,Vente,12000,,,SUR LE CHEM DE SAINT NICOL,B018,54760,54372,Moivrons,54,,,543720000B0370,,,,,,,,,,,,,0,,,,,BT,taillis simples,,,3040,6.231534,48.821398
2019-794935,2019-12-10,000001,Vente,12000,,,PETITE FROIDE TERRE,B079,54760,54372,Moivrons,54,,,543720000C0007,,,,,,,,,,,,,0,,,,,P,prés,,,3125,6.244103,48.834605
2019-794935,2019-12-10,000001,Vente,12000,,,PETITE FROIDE TERRE,B079,54760,54372,Moivrons,54,,,543720000C0014,,,,,,,,,,,,,0,,,,,T,terres,,,2026,6.24273,48.835291
2019-794935,2019-12-10,000001,Vente,12000,,,FONTAINE MAITRE ECHEVIN,B045,54760,54372,Moivrons,54,,,543720000C0042,,,,,,,,,,,,,0,,,,,P,prés,,,2208,6.243399,48.833607
2019-794935,2019-12-10,000001,Vente,12000,,,PETITE FROIDE TERRE,B079,54760,54372,Moivrons,54,,,543720000C0569,,,,,,,,,,,,,0,,,,,P,prés,,,1580,6.244504,48.834275
2019-794935,2019-12-10,000001,Vente,12000,,,FROIDE TERRE,B050,54760,54372,Moivrons,54,,,543720000C0595,,,,,,,,,,,,,0,,,,,P,prés,,,425,6.245699,48.83486
2019-794935,2019-12-10,000001,Vente,12000,,,FROIDE TERRE,B050,54760,54372,Moivrons,54,,,543720000C0595,,,,,,,,,,,,,0,,,,,P,prés,,,425,6.245699,48.83486
2019-794935,2019-12-10,000001,Vente,12000,,,LA SRESOTTE,B101,54760,54372,Moivrons,54,,,54372000ZA0023,,,,,,,,,,,,,0,,,,,T,terres,,,340,6.237113,48.83791
2019-795128,2019-12-11,000001,Vente,220000,5,B,GR GRAND RUE,0199,54760,54372,Moivrons,54,,,543720000D1328,,,,,,,,,,,,,0,1,Maison,100,6,S,sols,,,1011,6.255049,48.822687
2019-795128,2019-12-11,000001,Vente,220000,,,SUR LA CLAUSSE,B021,54760,54372,Moivrons,54,,,543720000D1330,,,,,,,,,,,,,0,,,,,VE,vergers,,,794,6.255093,48.822937
