id_mutation,date_mutation,numero_disposition,nature_mutation,valeur_fonciere,adresse_numero,adresse_suffixe,adresse_nom_voie,adresse_code_voie,code_postal,code_commune,nom_commune,code_departement,ancien_code_commune,ancien_nom_commune,id_parcelle,ancien_id_parcelle,numero_volume,lot1_numero,lot1_surface_carrez,lot2_numero,lot2_surface_carrez,lot3_numero,lot3_surface_carrez,lot4_numero,lot4_surface_carrez,lot5_numero,lot5_surface_carrez,nombre_lots,code_type_local,type_local,surface_reelle_bati,nombre_pieces_principales,code_nature_culture,nature_culture,code_nature_culture_speciale,nature_culture_speciale,surface_terrain,longitude,latitude
2019-788783,2019-05-06,000001,Vente,80000,,,LE VILLAGE,B050,54700,54387,Morville-sur-Seille,54,,,54387000AA0174,,,,,,,,,,,,,0,,,,,P,prés,,,3390,6.154396,48.916431
2019-788783,2019-05-06,000001,Vente,80000,18,,RUE HAUTE,0060,54700,54387,Morville-sur-Seille,54,,,54387000AA0177,,,,,,,,,,,,,0,,,,,S,sols,,,168,6.154693,48.91609
2019-788784,2019-05-06,000001,Vente,85000,,,LE VILLAGE,B050,54700,54387,Morville-sur-Seille,54,,,54387000AA0173,,,,,,,,,,,,,0,,,,,J,jardins,,,11,6.154846,48.916197
2019-788784,2019-05-06,000001,Vente,85000,16,,RUE HAUTE,0060,54700,54387,Morville-sur-Seille,54,,,54387000AA0175,,,,,,,,,,,,,0,1,Maison,110,5,S,sols,,,329,6.154899,48.91612
2019-789890,2019-05-24,000001,Vente,54500,,,LE VILLAGE,B050,54700,54387,Morville-sur-Seille,54,,,54387000AA0165,,,,,,,,,,,,,0,,,,,AB,terrains a bâtir,,,406,6.156467,48.915147
2019-790426,2019-07-16,000001,Vente,2500,,,AUX PAUX,B034,54700,54387,Morville-sur-Seille,54,,,54387000ZC0138,,,,,,,,,,,,,0,,,,,S,sols,,,1846,6.156767,48.914918
2019-792157,2019-09-12,000001,Vente,83990,,,AUX PAUX,B034,54700,54387,Morville-sur-Seille,54,,,54387000ZC0135,,,,,,,,,,,,,0,,,,,T,terres,,,506,6.156875,48.914685
2019-792157,2019-09-12,000001,Vente,83990,,,AUX PAUX,B034,54700,54387,Morville-sur-Seille,54,,,54387000ZC0135,,,,,,,,,,,,,0,,,,,AB,terrains a bâtir,,,544,6.156875,48.914685
