id_mutation,date_mutation,numero_disposition,nature_mutation,valeur_fonciere,adresse_numero,adresse_suffixe,adresse_nom_voie,adresse_code_voie,code_postal,code_commune,nom_commune,code_departement,ancien_code_commune,ancien_nom_commune,id_parcelle,ancien_id_parcelle,numero_volume,lot1_numero,lot1_surface_carrez,lot2_numero,lot2_surface_carrez,lot3_numero,lot3_surface_carrez,lot4_numero,lot4_surface_carrez,lot5_numero,lot5_surface_carrez,nombre_lots,code_type_local,type_local,surface_reelle_bati,nombre_pieces_principales,code_nature_culture,nature_culture,code_nature_culture_speciale,nature_culture_speciale,surface_terrain,longitude,latitude
2019-796104,2019-02-14,000001,Vente terrain à bâtir,74949.6,,,AUX TILLEULS,B046,54260,54514,Tellancourt,54,,,545140000Y0185,,,,,,,,,,,,,0,,,,,AB,terrains a bâtir,,,637,5.627817,49.504485
2019-796123,2019-02-25,000001,Vente terrain à bâtir,81170.4,,,AUX TILLEULS,B046,54260,54514,Tellancourt,54,,,545140000Y0193,,,,,,,,,,,,,0,,,,,AB,terrains a bâtir,,,694,5.628559,49.504651
2019-796128,2019-03-01,000001,Vente terrain à bâtir,85140,,,AUX TILLEULS,B046,54260,54514,Tellancourt,54,,,545140000Y0186,,,,,,,,,,,,,0,,,,,AB,terrains a bâtir,,,739,5.628052,49.504362
2019-796133,2019-02-21,000001,Vente,60000,,,LE VLG,B049,54260,54514,Tellancourt,54,,,545140000U0326,,,,,,,,,,,,,0,,,,,S,sols,,,325,5.633761,49.50835
2019-796133,2019-02-21,000001,Vente,60000,8,,RTE NATIONALE,0250,54260,54514,Tellancourt,54,,,545140000U0329,,,,,,,,,,,,,0,4,Local industriel. commercial ou assimilé,30,0,S,sols,,,240,5.633879,49.508378
2019-796133,2019-02-21,000001,Vente,60000,8,,RTE NATIONALE,0250,54260,54514,Tellancourt,54,,,545140000U0329,,,,,,,,,,,,,0,1,Maison,140,7,S,sols,,,240,5.633879,49.508378
2019-796133,2019-02-21,000001,Vente,60000,,,AU COURTIS,B014,54260,54514,Tellancourt,54,,,545140000X0032,,,,,,,,,,,,,0,,,,,P,prés,,,11975,5.634719,49.509753
2019-796133,2019-02-21,000001,Vente,60000,,,AU COURTIS,B014,54260,54514,Tellancourt,54,,,545140000X0033,,,,,,,,,,,,,0,,,,,P,prés,,,7100,5.633868,49.509032
2019-796210,2019-03-11,000001,Vente terrain à bâtir,77023.2,,,AUX TILLEULS,B046,54260,54514,Tellancourt,54,,,545140000Y0184,,,,,,,,,,,,,0,,,,,AB,terrains a bâtir,,,657,5.627694,49.504662
2019-796367,2019-03-26,000001,Vente,213951,3,,RUE ETIENNE BASTIEN,0050,54260,54514,Tellancourt,54,,,545140000U0134,,,,,,,,,,,,,0,1,Maison,111,6,S,sols,,,369,5.634391,49.507574
2019-796370,2019-03-11,000001,Vente terrain à bâtir,80515.2,,,AUX TILLEULS,B046,54260,54514,Tellancourt,54,,,545140000Y0189,,,,,,,,,,,,,0,,,,,AB,terrains a bâtir,,,688,5.628705,49.504375
2019-796554,2019-04-29,000001,Vente terrain à bâtir,79641.6,,,AUX TILLEULS,B046,54260,54514,Tellancourt,54,,,545140000Y0190,,,,,,,,,,,,,0,,,,,AB,terrains a bâtir,,,680,5.628983,49.504452
2019-796710,2019-05-10,000001,Vente,17064,,,PIECE D ACHIL,B042,54260,54514,Tellancourt,54,,,545140000X0268,,,,,,,,,,,,,0,,,,,T,terres,,,1194,5.631564,49.517063
2019-796710,2019-05-10,000001,Vente,17064,,,PIECE D ACHIL,B042,54260,54514,Tellancourt,54,,,545140000X0269,,,,,,,,,,,,,0,,,,,T,terres,,,773,5.632228,49.51684
2019-796753,2019-05-09,000001,Vente,280000,10,,RUE DE LA GROSSE PIERRE,0165,54260,54514,Tellancourt,54,,,545140000Y0162,,,,,,,,,,,,,0,1,Maison,97,4,J,jardins,,,366,5.627641,49.507695
2019-796753,2019-05-09,000001,Vente,280000,10,,RUE DE LA GROSSE PIERRE,0165,54260,54514,Tellancourt,54,,,545140000Y0162,,,,,,,,,,,,,0,1,Maison,97,4,S,sols,,,500,5.627641,49.507695
2019-796943,2019-05-18,000001,Vente,321400,,,DERRIERE PONTIGNY,B020,54260,54514,Tellancourt,54,,,545140000X0278,,,,,,,,,,,,,0,,,,,AB,terrains a bâtir,,,268,5.636494,49.507395
2019-797040,2019-06-05,000001,Vente terrain à bâtir,128404.8,,,AUX TILLEULS,B046,54260,54514,Tellancourt,54,,,545140000Y0187,,,,,,,,,,,,,0,,,,,AB,terrains a bâtir,,,1248,5.628255,49.50423
2019-797042,2019-06-06,000001,Vente terrain à bâtir,99000,,,AUX TILLEULS,B046,54260,54514,Tellancourt,54,,,545140000Y0201,,,,,,,,,,,,,0,,,,,AB,terrains a bâtir,,,972,5.627941,49.505498
2019-797081,2019-06-12,000001,Vente terrain à bâtir,83100,,,AUX TILLEULS,B046,54260,54514,Tellancourt,54,,,545140000Y0194,,,,,,,,,,,,,0,,,,,AB,terrains a bâtir,,,713,5.628248,49.504546
2019-797213,2019-05-20,000001,Vente terrain à bâtir,88795.2,,,AUX TILLEULS,B046,54260,54514,Tellancourt,54,,,545140000Y0191,,,,,,,,,,,,,0,,,,,AB,terrains a bâtir,,,782,5.629287,49.504512
2019-797218,2019-07-02,000001,Vente terrain à bâtir,90835.2,,,AUX TILLEULS,B046,54260,54514,Tellancourt,54,,,545140000Y0183,,,,,,,,,,,,,0,,,,,AB,terrains a bâtir,,,806,5.627591,49.504824
2019-797223,2019-06-24,000001,Vente,201700,5,,RUE DE JADOT,0180,54260,54514,Tellancourt,54,,,545140000U0006,,,,,,,,,,,,,0,1,Maison,131,6,S,sols,,,190,5.632325,49.5084
2019-797347,2019-07-15,000001,Vente,380750,4,,RUE DE LA DOUANE,0080,54260,54514,Tellancourt,54,,,545140000U0013,,,,,,,,,,,,,0,1,Maison,171,6,S,sols,,,1070,5.631637,49.507857
2019-797347,2019-07-15,000001,Vente,380750,4,,RUE DE LA DOUANE,0080,54260,54514,Tellancourt,54,,,545140000U0013,,,,,,,,,,,,,0,1,Maison,171,6,J,jardins,,,1650,5.631637,49.507857
2019-798000,2019-07-22,000001,Vente,25000,5,,RUE ETIENNE BASTIEN,0050,54260,54514,Tellancourt,54,,,545140000U0206,,,,,,,,,,,,,0,1,Maison,89,4,S,sols,,,80,5.63481,49.507026
2019-798000,2019-07-22,000001,Vente,25000,,,LE VLG,B049,54260,54514,Tellancourt,54,,,545140000U0297,,,,,,,,,,,,,0,,,,,L,landes,,,5,5.635267,49.505998
2019-798000,2019-07-22,000001,Vente,25000,,,LE VLG,B049,54260,54514,Tellancourt,54,,,545140000U0298,,,,,,,,,,,,,0,,,,,J,jardins,,,180,,
2019-798221,2019-10-04,000001,Vente,160000,11,,RUE DE LA DOUANE,0080,54260,54514,Tellancourt,54,,,545140000U0025,,,,,,,,,,,,,0,1,Maison,112,5,S,sols,,,340,5.630786,49.507088
2019-798221,2019-10-04,000001,Vente,160000,,,LE VLG,B049,54260,54514,Tellancourt,54,,,545140000U0186,,,,,,,,,,,,,0,,,,,J,jardins,,,594,5.630572,49.507014
2019-798221,2019-10-04,000001,Vente,160000,,,LE VLG,B049,54260,54514,Tellancourt,54,,,545140000U0217,,,,,,,,,,,,,0,,,,,J,jardins,,,335,5.630505,49.506875
2019-798706,2019-11-21,000001,Vente,75985,5234,,RUE DE LA DOUANE,0080,54260,54514,Tellancourt,54,,,545140000U0234,,,,,,,,,,,,,0,4,Local industriel. commercial ou assimilé,,0,J,jardins,,,1169,5.629837,49.507368
2019-798706,2019-11-21,000001,Vente,75985,,,LE VLG,B049,54260,54514,Tellancourt,54,,,545140000U0366,,,,,,,,,,,,,0,,,,,J,jardins,,,302,5.629947,49.507482
2019-798813,2019-12-05,000001,Vente,139000,6,,RUE DU GENERAL LECLERC,0150,54260,54514,Tellancourt,54,,,545140000U0245,,,,,,,,,,,,,0,1,Maison,105,5,S,sols,,,279,5.636421,49.508747
2019-798813,2019-12-05,000001,Vente,139000,,,LE VLG,B049,54260,54514,Tellancourt,54,,,545140000U0308,,,,,,,,,,,,,0,,,,,L,landes,,,34,5.63649,49.508661
2019-798877,2019-12-12,000001,Vente,252900,21,,RUE DU GENERAL DE GAULLE,0145,54260,54514,Tellancourt,54,,,545140000Y0119,,,,,,,,,,,,,0,1,Maison,88,4,S,sols,,,552,5.628941,49.508457
2019-799067,2019-11-29,000001,Vente terrain à bâtir,89644.8,,,AUX TILLEULS,B046,54260,54514,Tellancourt,54,,,545140000Y0192,,,,,,,,,,,,,0,,,,,AB,terrains a bâtir,,,791,5.628944,49.504782
2019-799149,2019-01-11,000001,Vente,169000,10,,RUE DE LA DOUANE,0080,54260,54514,Tellancourt,54,,,545140000U0208,,,,,,,,,,,,,0,1,Maison,130,5,J,jardins,,,730,,
2019-799149,2019-01-11,000001,Vente,169000,10,,RUE DE LA DOUANE,0080,54260,54514,Tellancourt,54,,,545140000U0208,,,,,,,,,,,,,0,1,Maison,130,5,S,sols,,,340,,
