id_mutation,date_mutation,numero_disposition,nature_mutation,valeur_fonciere,adresse_numero,adresse_suffixe,adresse_nom_voie,adresse_code_voie,code_postal,code_commune,nom_commune,code_departement,ancien_code_commune,ancien_nom_commune,id_parcelle,ancien_id_parcelle,numero_volume,lot1_numero,lot1_surface_carrez,lot2_numero,lot2_surface_carrez,lot3_numero,lot3_surface_carrez,lot4_numero,lot4_surface_carrez,lot5_numero,lot5_surface_carrez,nombre_lots,code_type_local,type_local,surface_reelle_bati,nombre_pieces_principales,code_nature_culture,nature_culture,code_nature_culture_speciale,nature_culture_speciale,surface_terrain,longitude,latitude
2019-801045,2019-02-05,000001,Vente,15489.9,,,LONGS SILLONS,B069,54115,54530,Tramont-Lassus,54,,,54530000ZE0055,,,,,,,,,,,,,0,,,,,T,terres,,,2035,5.956161,48.387932
2019-801968,2019-09-10,000001,Vente,350,,,SUR LE TAMBOIS,B111,54115,54530,Tramont-Lassus,54,,,54530000ZB0020,,,,,,,,,,,,,0,,,,,BR,futaies résineuses,,,1215,5.961707,48.402748
2019-802152,2019-10-11,000001,Vente,125000,10,,RUE DE DEVANT LA CROIX,0011,54115,54530,Tramont-Lassus,54,,,54530000ZA0137,,,,,,,,,,,,,0,1,Maison,97,4,S,sols,,,1090,5.962123,48.397397
2019-802152,2019-10-11,000001,Vente,125000,8,,RUE DE DEVANT LA CROIX,0011,54115,54530,Tramont-Lassus,54,,,54530000ZA0140,,,,,,,,,,,,,0,,,,,P,prés,,,983,5.96237,48.397285
2019-802260,2019-11-04,000001,Vente,3500,5001,,GR GRANDE RUE,0019,54115,54530,Tramont-Lassus,54,,,54530000ZA0030,,,,,,,,,,,,,0,3,Dépendance,,0,J,jardins,,,216,5.961804,48.396126
2019-802260,2019-11-04,000001,Vente,3500,5001,,GR GRANDE RUE,0019,54115,54530,Tramont-Lassus,54,,,54530000ZA0030,,,,,,,,,,,,,0,3,Dépendance,,0,S,sols,,,107,5.961804,48.396126
2019-802260,2019-11-04,000001,Vente,3500,,,LA CHAPELLE,B017,54115,54530,Tramont-Lassus,54,,,54530000ZB0040,,,,,,,,,,,,,0,,,,,BT,taillis simples,,,472,5.961745,48.408115
2019-802473,2019-12-19,000001,Vente,5000,5001,F,GR GRANDE RUE,0019,54115,54530,Tramont-Lassus,54,,,54530000ZA0028,,,,,,,,,,,,,0,3,Dépendance,,0,S,sols,,,326,5.961879,48.396331
